{"text_format":"2","workbook":"xlsx","n_sheets":3,"sheets":["SpPl. Vorrd.","Auswertung","SpPl. Zw.u.End-Rd."],"not_rendered":{"charts":0,"images":3,"macros":0,"external_links":1,"defined_names":1,"comments":0,"pivot_tables":0},"unopened":[],"bounds":{"document_bytes":16777216,"sheet_cells":100000,"run_cost":"one","rows_first":2000,"rows_last":500,"rows_between":2000,"halvings":0,"cell_chars":16384,"cell_head_chars":4096},"cells_cut":0,"cells_raw":0,"read":"whole","date_system":"1900"}

{"sheet":"SpPl. Vorrd.","index":0,"n_rows":111,"n_cols":32,"rows_kept":111,"cut":false,"hidden":false,"merged":[[6,13,6,17],[105,6,105,13],[106,6,106,13],[8,13,8,17],[91,6,91,11],[93,6,93,11],[93,13,93,18],[105,15,105,19],[106,15,106,19],[88,13,88,18],[88,19,90,23],[104,28,105,31],[102,28,103,31],[106,28,107,31],[108,28,109,31],[110,6,111,13],[110,15,111,19],[110,20,111,27],[109,20,109,27],[109,6,109,13],[108,20,108,27],[110,28,111,31],[108,15,108,19],[109,15,109,19],[110,1,111,1],[102,2,102,4],[110,2,111,4],[102,20,102,27],[103,20,103,27],[104,20,104,27],[105,20,105,27],[106,20,106,27],[107,6,107,13],[108,6,108,13],[102,15,102,19],[103,15,103,19],[104,15,104,19],[107,15,107,19],[104,6,104,13],[107,20,107,27],[102,6,102,13],[103,6,103,13],[95,24,95,27],[96,6,96,11],[96,13,96,18],[96,24,96,27],[90,24,90,27],[95,2,100,2],[95,6,95,11],[95,13,95,18],[95,19,97,23],[97,6,97,11],[97,13,97,18],[97,24,97,27],[98,6,98,11],[98,13,98,18],[98,19,100,23],[98,24,98,27],[99,6,99,11],[99,13,99,18],[99,24,99,27],[100,6,100,11],[100,24,100,27],[100,13,100,18],[88,2,93,2],[88,6,88,11],[88,24,88,27],[89,6,89,11],[89,13,89,18],[89,24,89,27],[90,6,90,11],[90,13,90,18],[91,13,91,18],[91,19,93,23],[91,24,91,27],[92,6,92,11],[92,13,92,18],[92,24,92,27],[93,24,93,27],[81,2,86,2],[81,6,81,11],[81,13,81,18],[81,19,83,23],[81,24,81,27],[82,6,82,11],[82,13,82,18],[82,24,82,27],[83,6,83,11],[83,13,83,18],[83,24,83,27],[84,6,84,11],[84,13,84,18],[84,19,86,23],[84,24,84,27],[85,6,85,11],[85,13,85,18],[85,24,85,27],[86,6,86,11],[86,13,86,18],[86,24,86,27],[74,2,79,2],[74,6,74,11],[74,13,74,18],[74,19,76,23],[74,24,74,27],[75,6,75,11],[75,13,75,18],[75,24,75,27],[76,6,76,11],[76,13,76,18],[76,24,76,27],[77,6,77,11],[77,13,77,18],[77,19,79,23],[77,24,77,27],[78,6,78,11],[78,13,78,18],[78,24,78,27],[79,6,79,11],[79,13,79,18],[79,24,79,27],[67,24,67,27],[68,6,68,11],[68,13,68,18],[68,24,68,27],[67,2,72,2],[67,6,67,11],[67,13,67,18],[67,19,69,23],[69,6,69,11],[69,13,69,18],[69,24,69,27],[70,6,70,11],[70,13,70,18],[70,19,72,23],[70,24,70,27],[71,6,71,11],[71,13,71,18],[71,24,71,27],[72,6,72,11],[72,13,72,18],[72,24,72,27],[60,2,65,2],[60,6,60,11],[60,13,60,18],[60,19,62,23],[60,24,60,27],[61,6,61,11],[61,13,61,18],[61,24,61,27],[62,6,62,11],[62,13,62,18],[63,6,63,11],[63,13,63,18],[63,19,65,23],[63,24,63,27],[64,6,64,11],[64,13,64,18],[64,24,64,27],[65,6,65,11],[65,13,65,18],[65,24,65,27],[53,2,58,2],[53,6,53,11],[53,13,53,18],[53,19,55,23],[53,24,53,27],[54,6,54,11],[54,13,54,18],[54,24,54,27],[55,6,55,11],[55,13,55,18],[55,24,55,27],[56,6,56,11],[56,13,56,18],[56,19,58,23],[56,24,56,27],[57,6,57,11],[57,13,57,18],[57,24,57,27],[58,6,58,11],[58,13,58,18],[58,24,58,27],[46,2,51,2],[46,6,46,11],[46,13,46,18],[46,19,48,23],[46,24,46,27],[47,6,47,11],[47,13,47,18],[47,24,47,27],[48,6,48,11],[48,13,48,18],[48,24,48,27],[49,6,49,11],[49,13,49,18],[49,19,51,23],[49,24,49,27],[50,6,50,11],[50,13,50,18],[50,24,50,27],[51,6,51,11],[51,13,51,18],[51,24,51,27],[39,24,39,27],[40,6,40,11],[40,13,40,18],[40,24,40,27],[39,2,44,2],[39,6,39,11],[39,13,39,18],[39,19,41,23],[41,6,41,11],[41,13,41,18],[41,24,41,27],[42,6,42,11],[42,13,42,18],[42,19,44,23],[42,24,42,27],[43,6,43,11],[43,13,43,18],[43,24,43,27],[44,6,44,11],[44,13,44,18],[44,24,44,27],[32,2,37,2],[32,6,32,11],[32,13,32,18],[32,19,34,23],[32,24,32,27],[33,6,33,11],[33,13,33,18],[33,24,33,27],[34,6,34,11],[34,13,34,18],[34,24,34,27],[35,6,35,11],[35,13,35,18],[35,19,37,23],[35,24,35,27],[36,6,36,11],[36,13,36,18],[36,24,36,27],[37,6,37,11],[37,13,37,18],[37,24,37,27],[25,2,30,2],[25,6,25,11],[25,13,25,18],[25,19,27,23],[25,24,25,27],[26,6,26,11],[26,13,26,18],[26,24,26,27],[27,6,27,11],[27,13,27,18],[27,24,27,27],[28,6,28,11],[28,13,28,18],[28,19,30,23],[28,24,28,27],[29,6,29,11],[29,13,29,18],[29,24,29,27],[30,6,30,11],[30,13,30,18],[30,24,30,27],[20,24,20,27],[21,6,21,11],[21,13,21,18],[21,19,23,23],[18,2,23,2],[18,6,18,11],[18,13,18,18],[18,19,20,23],[18,24,18,27],[19,6,19,11],[19,13,19,18],[19,24,19,27],[20,6,20,11],[20,13,20,18],[21,24,21,27],[22,6,22,11],[22,13,22,18],[22,24,22,27],[23,6,23,11],[23,13,23,18],[23,24,23,27],[13,2,13,5],[13,7,13,11],[13,13,13,17],[13,19,13,31],[12,2,12,5],[12,7,12,11],[12,13,12,17],[11,19,12,23],[15,1,15,2],[15,4,16,4],[15,6,16,18],[15,19,16,23],[15,29,16,31],[15,24,16,27],[0,1,0,29],[1,1,1,30],[3,1,3,11],[11,2,11,5],[11,7,11,11],[11,13,11,17],[11,24,12,27],[11,28,12,31],[5,1,5,17],[6,2,6,5],[5,19,6,31],[7,19,8,23],[7,24,8,27],[7,28,8,31],[9,19,10,23],[9,24,10,27],[9,28,10,31],[8,2,8,5],[8,7,8,11],[10,1,10,17],[7,2,7,5],[7,7,7,11],[7,13,7,17],[6,7,6,11]]}
[null,{"$f":"[1]Beschrieb!C1","v":"19. Deutsche Meisterschft im Boccia (Halle)"}]
[null,{"$f":"[1]Beschrieb!C2","v":"am 28./29.Juli 2023 in Wiesbaden, LV Hessen"}]
[]
[null,{"$f":"[1]Beschrieb!C4","v":"18 Teilnehmer aus 11 Landesverbänden"}]
[]
[null,"Teilnehmer Gruppe A:",{"$nulls":17},"Schiedsrichter:"]
[null,"1.",{"$f":"[1]Beschrieb!C6","v":"BRS Gersweiler 1"},null,null,null,"4.",{"$f":"[1]Beschrieb!C9","v":"VSG Gelsenkirchen"},{"$nulls":4},"7.",{"$f":"[1]Beschrieb!D8","v":"BSG Offenburg"}]
[null,"2.",{"$f":"[1]Beschrieb!C7","v":"BSSV Köthen"},null,null,null,"5.",{"$f":"[1]Beschrieb!D6","v":"ZGS Berlin"},{"$nulls":4},"8.",{"$f":"[1]Beschrieb!D9","v":"RSG Partenstein"},{"$nulls":5},{"$f":"[1]Beschrieb!C12","v":"Beck Adolph"},{"$nulls":4},{"$f":"[1]Beschrieb!D12","v":"Schmid K.-H."},null,null,null,{"$f":"[1]Beschrieb!E12","v":"S.-Anh.--Berlin"}]
[null,"3.",{"$f":"[1]Beschrieb!C8","v":"TV Markgröningen"},null,null,null,"6.",{"$f":"[1]Beschrieb!D7","v":"Rh. Wiesbaden 2"},{"$nulls":4},"9.",{"$f":"[1]Beschrieb!D10","v":"BVS Weiden"}]
[{"$nulls":19},{"$f":"[1]Beschrieb!C13","v":"Schmid Angelika"},{"$nulls":4},{"$f":"[1]Beschrieb!D13","v":"Ahrend "},null,null,null,{"$f":"[1]Beschrieb!E13","v":"NRW"}]
[null,"Teilnehmer Gruppe B"]
[null,"1.",{"$f":"[1]Beschrieb!E6","v":"Rhinos Wiesbaden 1"},null,null,null,"4.",{"$f":"[1]Beschrieb!E9","v":"BRS Gersweiler 2"},{"$nulls":4},"7.",{"$f":"[1]Beschrieb!F8","v":"        Grevesmühlen"},{"$nulls":5},{"$f":"[1]Beschrieb!C14","v":"Friedrich Christian"},{"$nulls":4},{"$f":"[1]Beschrieb!D14","v":"Bayern"},null,null,null,{"$f":"[1]Beschrieb!E14","v":"Saarland"}]
[null,"2.",{"$f":"[1]Beschrieb!E7","v":"VSG Stadthagen"},null,null,null,"5.",{"$f":"[1]Beschrieb!F6","v":"        BRV Berlin"},{"$nulls":4},"8.",{"$f":"[1]Beschrieb!F9","v":"        RBA Neumarkt"}]
[null,"3.",{"$f":"[1]Beschrieb!E8","v":"BSG Nordwalde"},null,null,null,"6.",{"$f":"[1]Beschrieb!F7","v":"        Rh. Leipzig"},{"$nulls":4},"9.",{"$f":"[1]Beschrieb!F10","v":"        BSG Mettmann"}]
[]
[null,"Spiel",null,null,"Bahn:",null,"Mannschaften:",{"$nulls":12},"Linienrichter",{"$nulls":4},"Schiedsrichter",{"$nulls":4},"Ergebnis:"]
[null,"Nr."," DG Zeit"]
[]
[null,1,"DG 1   12.15",null,1,null,{"$f":"C7","v":"BRS Gersweiler 1"},{"$nulls":6},{"$f":"H8","v":"ZGS Berlin"},{"$nulls":5},{"$f":"H7","v":"VSG Gelsenkirchen"},{"$nulls":4},{"$f":"T8","v":"Beck Adolph"},{"$nulls":4},19,":",8]
[null,2,null,null,2,null,{"$f":"C8","v":"BSSV Köthen"},{"$nulls":6},{"$f":"H9","v":"Rh. Wiesbaden 2"},{"$nulls":10},{"$f":"T10","v":"Schmid Angelika"},{"$nulls":4},12,":",12]
[null,3,null,null,3,null,{"$f":"C9","v":"TV Markgröningen"},{"$nulls":6},{"$f":"N7","v":"BSG Offenburg"},{"$nulls":10},{"$f":"T12","v":"Friedrich Christian"},{"$nulls":4},20,":",7]
[null,4,null,null,4,null,{"$f":"C12","v":"Rhinos Wiesbaden 1"},{"$nulls":6},{"$f":"H13","v":"        BRV Berlin"},{"$nulls":5},{"$f":"H12","v":"BRS Gersweiler 2"},{"$nulls":4},{"$f":"Y8","v":"Schmid K.-H."},{"$nulls":4},13,":",11]
[null,5,null,null,5,null,{"$f":"C13","v":"VSG Stadthagen"},{"$nulls":6},{"$f":"H14","v":"        Rh. Leipzig"},{"$nulls":10},"Rödel",{"$nulls":4},20,":",6]
[null,6,null,null,6,null,{"$f":"C14","v":"BSG Nordwalde"},{"$nulls":6},{"$f":"N12","v":"        Grevesmühlen"},{"$nulls":10},"NRW",{"$nulls":4},17,":",9]
[]
[null,7,"DG 2   13.05",null,1,null,{"$f":"H7","v":"VSG Gelsenkirchen"},{"$nulls":6},{"$f":"N8","v":"RSG Partenstein"},{"$nulls":5},{"$f":"C8","v":"BSSV Köthen"},{"$nulls":4},"Rödel",{"$nulls":4},14,":"]
[null,8,null,null,2,null,{"$f":"H8","v":"ZGS Berlin"},{"$nulls":6},{"$f":"N9","v":"BVS Weiden"},{"$nulls":10},"Keller Thomas",{"$nulls":4},7,":",16]
[null,9,null,null,3,null,{"$f":"C7","v":"BRS Gersweiler 1"},{"$nulls":6},{"$f":"H9","v":"Rh. Wiesbaden 2"},{"$nulls":10},"Sa.-Anhalt",{"$nulls":4},6,":",18]
[null,10,null,null,4,null,{"$f":"H12","v":"BRS Gersweiler 2"},{"$nulls":6},{"$f":"N13","v":"        RBA Neumarkt"},{"$nulls":5},{"$f":"C13","v":"VSG Stadthagen"},{"$nulls":4},{"$f":"T8","v":"Beck Adolph"},{"$nulls":4},13,":",5]
[null,11,null,null,5,null,{"$f":"H13","v":"        BRV Berlin"},{"$nulls":6},{"$f":"N14","v":"        BSG Mettmann"},{"$nulls":10},{"$f":"T10","v":"Schmid Angelika"},{"$nulls":4},7,":",18]
[null,12,null,null,6,null,{"$f":"C12","v":"Rhinos Wiesbaden 1"},{"$nulls":6},{"$f":"H14","v":"        Rh. Leipzig"},{"$nulls":10},{"$f":"T12","v":"Friedrich Christian"},{"$nulls":4},9,":",7]
[]
[null,13,"DG 3   14.00   ",null,1,null,{"$f":"C8","v":"BSSV Köthen"},{"$nulls":6},{"$f":"N7","v":"BSG Offenburg"},{"$nulls":5},{"$f":"C7","v":"BRS Gersweiler 1"},{"$nulls":4},"Schmid Angel.",{"$nulls":4},21,":",11]
[null,14,null,null,2,null,{"$f":"C9","v":"TV Markgröningen"},{"$nulls":6},{"$f":"N8","v":"RSG Partenstein"},{"$nulls":10},"Ahrens",{"$nulls":4},17,":",9]
[null,15,null,null,3,null,{"$f":"H7","v":"VSG Gelsenkirchen"},{"$nulls":6},{"$f":"N9","v":"BVS Weiden"},{"$nulls":10},"Gersweiler 1",{"$nulls":4},11,":",14]
[null,16,null,null,4,null,{"$f":"C13","v":"VSG Stadthagen"},{"$nulls":6},{"$f":"N12","v":"        Grevesmühlen"},{"$nulls":5},{"$f":"C12","v":"Rhinos Wiesbaden 1"},{"$nulls":4},"Berlin",{"$nulls":4},15,":",9]
[null,17,null,null,5,null,{"$f":"C14","v":"BSG Nordwalde"},{"$nulls":6},{"$f":"N13","v":"        RBA Neumarkt"},{"$nulls":10},"Rödel",{"$nulls":4},5,":",19]
[null,18,null,null,6,null,{"$f":"H12","v":"BRS Gersweiler 2"},{"$nulls":6},{"$f":"N14","v":"        BSG Mettmann"},{"$nulls":10},"NRW",{"$nulls":4},13,":",10]
[]
[null,19,"DG 4   14.55",null,1,null,{"$f":"C7","v":"BRS Gersweiler 1"},{"$nulls":6},{"$f":"N7","v":"BSG Offenburg"},{"$nulls":5},{"$f":"H8","v":"ZGS Berlin"},{"$nulls":4},"Bayern",{"$nulls":4},17,":",10]
[null,20,null,null,2,null,{"$f":"C8","v":"BSSV Köthen"},{"$nulls":6},{"$f":"N8","v":"RSG Partenstein"},{"$nulls":10},"Friedrich Christian",{"$nulls":4},12,":",9]
[null,21,null,null,3,null,{"$f":"C9","v":"TV Markgröningen"},{"$nulls":6},{"$f":"N9","v":"BVS Weiden"},{"$nulls":10},"Schmid Angelika",{"$nulls":4},9,":",12]
[null,22,null,null,4,null,{"$f":"C12","v":"Rhinos Wiesbaden 1"},{"$nulls":6},{"$f":"N12","v":"        Grevesmühlen"},{"$nulls":5},{"$f":"H13","v":"        BRV Berlin"},{"$nulls":4},"Tamm",{"$nulls":4},10,":",12]
[null,23,null,null,5,null,{"$f":"C13","v":"VSG Stadthagen"},{"$nulls":6},{"$f":"N13","v":"        RBA Neumarkt"},{"$nulls":10},"Gersweiler 2",{"$nulls":4},9,":",10]
[null,24,null,null,6,null,{"$f":"C14","v":"BSG Nordwalde"},{"$nulls":6},{"$f":"N14","v":"        BSG Mettmann"},{"$nulls":10},"NRW",{"$nulls":4},8,":",12]
[]
[null,25,"DG 5   15.45",null,1,null,{"$f":"H7","v":"VSG Gelsenkirchen"},{"$nulls":6},{"$f":"H8","v":"ZGS Berlin"},{"$nulls":5},{"$f":"C9","v":"TV Markgröningen"},{"$nulls":4},"Rödel",{"$nulls":4},13,":",10]
[null,26,null,null,2,null,{"$f":"H9","v":"Rh. Wiesbaden 2"},{"$nulls":6},{"$f":"N7","v":"BSG Offenburg"},{"$nulls":10},"Gersweiler 1",{"$nulls":4},9,":",11]
[null,27,null,null,3,null,{"$f":"N8","v":"RSG Partenstein"},{"$nulls":6},{"$f":"N9","v":"BVS Weiden"},{"$nulls":10},"Köthen",{"$nulls":4},11,":",15]
[null,28,null,null,4,null,{"$f":"H12","v":"BRS Gersweiler 2"},{"$nulls":6},{"$f":"H13","v":"        BRV Berlin"},{"$nulls":5},{"$f":"C14","v":"BSG Nordwalde"},{"$nulls":4},"Keller Thomas",{"$nulls":4},14,":",10]
[null,29,null,null,5,null,{"$f":"H14","v":"        Rh. Leipzig"},{"$nulls":6},{"$f":"N12","v":"        Grevesmühlen"},{"$nulls":10},{"$f":"T10","v":"Schmid Angelika"},{"$nulls":4},7,":",12]
[null,30,null,null,6,null,{"$f":"N13","v":"        RBA Neumarkt"},{"$nulls":6},{"$f":"N14","v":"        BSG Mettmann"},{"$nulls":10},{"$f":"T12","v":"Friedrich Christian"},{"$nulls":4},13,":",10]
[]
[null,31,"DG 6   16.35",null,1,null,{"$f":"C8","v":"BSSV Köthen"},{"$nulls":6},{"$f":"C9","v":"TV Markgröningen"},{"$nulls":5},{"$f":"N7","v":"BSG Offenburg"},{"$nulls":4},{"$f":"Y8","v":"Schmid K.-H."},{"$nulls":4},15,":",11]
[null,32,null,null,2,null,{"$f":"C7","v":"BRS Gersweiler 1"},{"$nulls":6},{"$f":"H7","v":"VSG Gelsenkirchen"},{"$nulls":10},"Meckl. Vorp.",{"$nulls":4},9,":",11]
[null,33,null,null,3,null,{"$f":"H8","v":"ZGS Berlin"},{"$nulls":6},{"$f":"H9","v":"Rh. Wiesbaden 2"},{"$nulls":10},{"$f":"Y12","v":"Bayern"},{"$nulls":4},11,":",8]
[null,34,null,null,4,null,{"$f":"C13","v":"VSG Stadthagen"},{"$nulls":6},{"$f":"C14","v":"BSG Nordwalde"},{"$nulls":5},{"$f":"N12","v":"        Grevesmühlen"},{"$nulls":4},"Rödel",{"$nulls":4},11,":",14]
[null,35,null,null,5,null,{"$f":"C12","v":"Rhinos Wiesbaden 1"},{"$nulls":6},{"$f":"H12","v":"BRS Gersweiler 2"},{"$nulls":10},"Schmid  Angel.",{"$nulls":4},9,":",14]
[null,36,null,null,6,null,{"$f":"H13","v":"        BRV Berlin"},{"$nulls":6},{"$f":"H14","v":"        Rh. Leipzig"},{"$nulls":10},"NRW",{"$nulls":4},8,":",11]
[]
[null,37,"DG 7   17.30",null,1,null,{"$f":"C7","v":"BRS Gersweiler 1"},{"$nulls":6},{"$f":"C8","v":"BSSV Köthen"},{"$nulls":5},{"$f":"H9","v":"Rh. Wiesbaden 2"},{"$nulls":4},{"$f":"T8","v":"Beck Adolph"},{"$nulls":4},14,":",10]
[null,38,null,null,2,null,{"$f":"C9","v":"TV Markgröningen"},{"$nulls":6},{"$f":"H7","v":"VSG Gelsenkirchen"},{"$nulls":10},"Friedrich Christian",{"$nulls":4},20,":",8]
[null,39,null,null,3,null,{"$f":"N7","v":"BSG Offenburg"},{"$nulls":6},{"$f":"N8","v":"RSG Partenstein"},{"$nulls":10},"Schmid Angelika",{"$nulls":4},8,":",19]
[null,40,null,null,4,null,{"$f":"C12","v":"Rhinos Wiesbaden 1"},{"$nulls":6},{"$f":"C13","v":"VSG Stadthagen"},{"$nulls":5},{"$f":"H14","v":"        Rh. Leipzig"},{"$nulls":4},{"$f":"Y8","v":"Schmid K.-H."},{"$nulls":4},8,":",13]
[null,41,null,null,5,null,{"$f":"C14","v":"BSG Nordwalde"},{"$nulls":6},{"$f":"H12","v":"BRS Gersweiler 2"},{"$nulls":10},"Tamm",{"$nulls":4},8,":",7]
[null,42,null,null,6,null,{"$f":"N12","v":"        Grevesmühlen"},{"$nulls":6},{"$f":"N13","v":"        RBA Neumarkt"},{"$nulls":10},"Berlin",{"$nulls":4},6,":",16]
[]
[null,43,"DG 8   18:20",null,1,null,{"$f":"H9","v":"Rh. Wiesbaden 2"},{"$nulls":6},{"$f":"N9","v":"BVS Weiden"},{"$nulls":5},{"$f":"C7","v":"BRS Gersweiler 1"},{"$nulls":4},"Rödel",{"$nulls":4},8,":",19]
[null,44,null,null,2,null,{"$f":"H8","v":"ZGS Berlin"},{"$nulls":6},{"$f":"N8","v":"RSG Partenstein"},{"$nulls":10},"Gersweiler 1",{"$nulls":4},7,":",15]
[null,45,null,null,3,null,{"$f":"H7","v":"VSG Gelsenkirchen"},{"$nulls":6},{"$f":"N7","v":"BSG Offenburg"},{"$nulls":10},"Sa.-Anh.",{"$nulls":4},24,":",6]
[null,46,null,null,4,null,{"$f":"H14","v":"        Rh. Leipzig"},{"$nulls":6},{"$f":"N14","v":"        BSG Mettmann"},{"$nulls":5},{"$f":"C12","v":"Rhinos Wiesbaden 1"},{"$nulls":4},{"$f":"T8","v":"Beck Adolph"},{"$nulls":4},16,":",9]
[null,47,null,null,5,null,{"$f":"H13","v":"        BRV Berlin"},{"$nulls":6},{"$f":"N13","v":"        RBA Neumarkt"},{"$nulls":10},"Keller Thomas",{"$nulls":4},7,":",17]
[null,48,null,null,6,null,{"$f":"H12","v":"BRS Gersweiler 2"},{"$nulls":6},{"$f":"N12","v":"        Grevesmühlen"},{"$nulls":10},"NRW",{"$nulls":4},11,":",11]
[{"$nulls":6},"Unterbrechung bis Samstag  9:00 Uhr"]
[null,49,"DG 9   9:05",null,1,null,{"$f":"C9","v":"TV Markgröningen"},{"$nulls":6},{"$f":"H9","v":"Rh. Wiesbaden 2"},{"$nulls":5},{"$f":"N8","v":"RSG Partenstein"},{"$nulls":4},{"$f":"Y8","v":"Schmid K.-H."},{"$nulls":4},13,":",11]
[null,50,null,null,2,null,{"$f":"C8","v":"BSSV Köthen"},{"$nulls":6},{"$f":"H8","v":"ZGS Berlin"},{"$nulls":10},"Meckl.-Vorp.",{"$nulls":4},15,":",9]
[null,51,null,null,3,null,{"$f":"C7","v":"BRS Gersweiler 1"},{"$nulls":6},{"$f":"N9","v":"BVS Weiden"},{"$nulls":10},{"$f":"Y12","v":"Bayern"},{"$nulls":4},16,":",10]
[null,52,null,null,4,null,{"$f":"C14","v":"BSG Nordwalde"},{"$nulls":6},{"$f":"H14","v":"        Rh. Leipzig"},{"$nulls":5},{"$f":"N13","v":"        RBA Neumarkt"},{"$nulls":4},"Gersweiler2",{"$nulls":4},20,":",4]
[null,53,null,null,5,null,{"$f":"C13","v":"VSG Stadthagen"},{"$nulls":6},{"$f":"H13","v":"        BRV Berlin"},{"$nulls":10},"NRW",{"$nulls":4},11,":",13]
[null,54,null,null,6,null,{"$f":"C12","v":"Rhinos Wiesbaden 1"},{"$nulls":6},{"$f":"N14","v":"        BSG Mettmann"},{"$nulls":10},"Schmid Angelika",{"$nulls":4},9,":",12]
[]
[null,55,"DG 10   10.00",null,1,null,{"$f":"H7","v":"VSG Gelsenkirchen"},{"$nulls":6},{"$f":"H9","v":"Rh. Wiesbaden 2"},{"$nulls":5},{"$f":"N9","v":"BVS Weiden"},{"$nulls":4},"Sa.-Anh.",{"$nulls":4},16,":",11]
[null,56,null,null,2,null,{"$f":"H8","v":"ZGS Berlin"},{"$nulls":6},{"$f":"N7","v":"BSG Offenburg"},{"$nulls":10},"Rödel",{"$nulls":4},12,":",10]
[null,57,null,null,3,null,{"$f":"C7","v":"BRS Gersweiler 1"},{"$nulls":6},{"$f":"N8","v":"RSG Partenstein"},{"$nulls":10},{"$f":"T12","v":"Friedrich Christian"},{"$nulls":4},12,":",14]
[null,58,null,null,4,null,{"$f":"H12","v":"BRS Gersweiler 2"},{"$nulls":6},{"$f":"H14","v":"        Rh. Leipzig"},{"$nulls":5},{"$f":"N14","v":"        BSG Mettmann"},{"$nulls":4},{"$f":"Y8","v":"Schmid K.-H."},{"$nulls":4},15,":",8]
[null,59,null,null,5,null,{"$f":"H13","v":"        BRV Berlin"},{"$nulls":6},{"$f":"N12","v":"        Grevesmühlen"},{"$nulls":10},"Keller Thomas",{"$nulls":4},14,":",15]
[null,60,null,null,6,null,{"$f":"C12","v":"Rhinos Wiesbaden 1"},{"$nulls":6},{"$f":"N13","v":"        RBA Neumarkt"},{"$nulls":10},{"$f":"Y12","v":"Bayern"},{"$nulls":4},10,":",9]
[]
[null,61,"Dg 11   10.50",null,1,null,{"$f":"C8","v":"BSSV Köthen"},{"$nulls":6},{"$f":"N9","v":"BVS Weiden"},{"$nulls":5},{"$f":"H7","v":"VSG Gelsenkirchen"},{"$nulls":4},"Gersweiler 1",{"$nulls":4},13,":",10]
[null,62,null,null,2,null,{"$f":"C9","v":"TV Markgröningen"},{"$nulls":6},{"$f":"H8","v":"ZGS Berlin"},{"$nulls":10},"Meckl.-Vorp.",{"$nulls":4},16,":",9]
[null,63,null,null,3,null,{"$f":"H9","v":"Rh. Wiesbaden 2"},{"$nulls":6},{"$f":"N8","v":"RSG Partenstein"},{"$nulls":10},"NRW",{"$nulls":4},7,":",14]
[null,64,null,null,4,null,{"$f":"C13","v":"VSG Stadthagen"},{"$nulls":6},{"$f":"N14","v":"        BSG Mettmann"},{"$nulls":5},{"$f":"H12","v":"BRS Gersweiler 2"},{"$nulls":4},"Gersweiler 2",{"$nulls":4},13,":",11]
[null,65,null,null,5,null,{"$f":"C14","v":"BSG Nordwalde"},{"$nulls":6},{"$f":"H13","v":"        BRV Berlin"},{"$nulls":10},{"$f":"T10","v":"Schmid Angelika"},{"$nulls":4},11,":",9]
[null,66,null,null,6,null,{"$f":"H14","v":"        Rh. Leipzig"},{"$nulls":6},{"$f":"N13","v":"        RBA Neumarkt"},{"$nulls":10},{"$f":"T12","v":"Friedrich Christian"},{"$nulls":4},9,":",11]
[]
[null,67,"DG 12   11.40",null,1,null,{"$f":"N7","v":"BSG Offenburg"},{"$nulls":6},{"$f":"N9","v":"BVS Weiden"},{"$nulls":5},{"$f":"H8","v":"ZGS Berlin"},{"$nulls":4},{"$f":"Y8","v":"Schmid K.-H."},{"$nulls":4},8,":",25]
[null,68,null,null,2,null,{"$f":"C8","v":"BSSV Köthen"},{"$nulls":6},{"$f":"H7","v":"VSG Gelsenkirchen"},{"$nulls":10},"Berlin",{"$nulls":4},15,":",9]
[null,69,null,null,3,null,{"$f":"C7","v":"BRS Gersweiler 1"},{"$nulls":6},{"$f":"C9","v":"TV Markgröningen"},{"$nulls":10},"Rödel",{"$nulls":4},8,":",9]
[null,70,null,null,4,null,{"$f":"N12","v":"        Grevesmühlen"},{"$nulls":6},{"$f":"N14","v":"        BSG Mettmann"},{"$nulls":5},{"$f":"H13","v":"        BRV Berlin"},{"$nulls":4},"Schmid Angelika",{"$nulls":4},8,":",14]
[null,71,null,null,5,null,{"$f":"C13","v":"VSG Stadthagen"},{"$nulls":6},{"$f":"H12","v":"BRS Gersweiler 2"},{"$nulls":10},"Beck Adolph",{"$nulls":4},8,":",15]
[null,72,null,null,6,null,{"$f":"C12","v":"Rhinos Wiesbaden 1"},{"$nulls":6},{"$f":"C14","v":"BSG Nordwalde"},{"$nulls":10},"Tamm",{"$nulls":4},18,":",7]
[]
[null,null,"1. Gr. A:",null,null,null,"1.A",{"$nulls":8},"1. Gr. B:",{"$nulls":4},"1.B",{"$nulls":7},"Plätze 1 bis 4"]
[null,null,"2. Gr. A:",null,null,null,"2.A",{"$nulls":8},"2. Gr. B:",{"$nulls":4},"2.B"]
[null,null,"3. Gr. A:",null,null,null,"3.A",{"$nulls":8},"3. Gr. B:",{"$nulls":4},"3.B",{"$nulls":7},"Plätze 5 bis 8"]
[null,null,"4. Gr. A:",null,null,null,"4.A",{"$nulls":8},"4. Gr. B:",{"$nulls":4},"4.B"]
[null,null,"5. Gr. A:",null,null,null,"5.A",{"$nulls":8},"5. Gr. B:",{"$nulls":4},"5.B",{"$nulls":7},"Plätze 9 bis 12"]
[null,null,"6. Gr. A:",null,null,null,"6.A",{"$nulls":8},"6. Gr. B:",{"$nulls":4},"6.B"]
[null,null,"7. Gr. A:",null,null,null,"7.A",{"$nulls":8},"7. Gr. B:",{"$nulls":4},"7.B",{"$nulls":7},"Plätze 13 bis 16"]
[null,null,"8. Gr. A:",null,null,null,"8.A",{"$nulls":8},"8. Gr. B:",{"$nulls":4},"8.B"]
[null,null,"9. Gr. A:",null,null,null,"9.A",{"$nulls":8},"9. Gr. B:",{"$nulls":4},"9.B",{"$nulls":7},"Platz 17 und 18"]

{"sheet":"Auswertung","index":1,"n_rows":48,"n_cols":24,"rows_kept":48,"cut":false,"hidden":false,"merged":[[15,1,16,1],[17,1,18,1],[19,0,20,0],[17,22,18,22],[19,22,20,22],[2,2,3,3],[2,1,3,1],[5,1,6,1],[2,23,3,23],[3,20,3,21],[2,14,3,15],[2,22,3,22],[2,16,3,17],[2,18,3,19],[2,20,2,21],[11,23,12,23],[12,20,12,21],[13,0,14,0],[13,23,14,23],[14,20,14,21],[23,0,23,23],[5,23,6,23],[6,20,6,21],[5,0,6,0],[19,23,20,23],[20,20,20,21],[21,0,22,0],[21,23,22,23],[22,20,22,21],[19,1,20,1],[11,1,12,1],[13,1,14,1],[21,1,22,1],[15,0,16,0],[15,23,16,23],[16,20,16,21],[17,0,18,0],[17,23,18,23],[18,20,18,21],[30,0,31,0],[30,1,31,1],[30,23,31,23],[31,20,31,21],[30,22,31,22],[1,3,1,19],[1,20,1,23],[0,0,0,23],[0,24,23,24],[2,0,3,0],[2,4,3,5],[2,6,3,7],[2,8,3,9],[2,10,3,11],[2,12,3,13],[7,0,8,0],[7,23,8,23],[8,20,8,21],[9,0,10,0],[9,23,10,23],[10,20,10,21],[7,1,8,1],[9,1,10,1],[11,0,12,0],[32,0,33,0],[32,1,33,1],[32,23,33,23],[33,20,33,21],[32,22,33,22],[25,24,48,24],[26,3,26,19],[26,20,26,23],[27,0,28,0],[27,2,28,3],[27,4,28,5],[27,6,28,7],[27,8,28,9],[27,10,28,11],[27,1,28,1],[27,18,28,19],[27,20,27,21],[27,22,28,22],[25,0,25,23],[27,23,28,23],[28,20,28,21],[27,12,28,13],[27,14,28,15],[27,16,28,17],[36,0,37,0],[36,1,37,1],[36,23,37,23],[37,20,37,21],[36,22,37,22],[34,0,35,0],[34,1,35,1],[34,23,35,23],[35,20,35,21],[34,22,35,22],[44,1,45,1],[44,23,45,23],[45,20,45,21],[44,22,45,22],[38,0,39,0],[38,1,39,1],[38,23,39,23],[39,20,39,21],[38,22,39,22],[21,22,22,22],[5,22,6,22],[7,22,8,22],[9,22,10,22],[11,22,12,22],[13,22,14,22],[15,22,16,22],[48,0,48,23],[40,0,41,0],[40,1,41,1],[40,23,41,23],[41,20,41,21],[40,22,41,22],[46,0,47,0],[46,1,47,1],[46,23,47,23],[47,20,47,21],[46,22,47,22],[42,0,43,0],[42,1,43,1],[42,23,43,23],[43,20,43,21],[42,22,43,22],[44,0,45,0]]}
[]
[null,null,null,{"$f":"[1]Beschrieb!$C$1","v":"19. Deutsche Meisterschft im Boccia (Halle)"}]
["Vereine",null,{"$f":"[1]Beschrieb!$C$6","v":"BRS Gersweiler 1"},null,{"$f":"[1]Beschrieb!$C$7","v":"BSSV Köthen"},null,{"$f":"[1]Beschrieb!$C$8","v":"TV Markgröningen"},null,{"$f":"[1]Beschrieb!$C$9","v":"VSG Gelsenkirchen"},null,{"$f":"[1]Beschrieb!$D$6","v":"ZGS Berlin"},null,{"$f":"[1]Beschrieb!$D$7","v":"Rh. Wiesbaden 2"},null,{"$f":"[1]Beschrieb!$D$8","v":"BSG Offenburg"},null,{"$f":"[1]Beschrieb!$D$9","v":"RSG Partenstein"},null,{"$f":"[1]Beschrieb!$D$10","v":"BVS Weiden"},null,"Treffer",null,"Pluspunkte","Platz"]
[{"$nulls":20},"Punkte"]
[null,null,"+","-"," ","-","+","-","+","-","+","-","+","-","+","-","+","-","+","-","+","-"]
[null,{"$f":"[1]Beschrieb!$C$6","v":"BRS Gersweiler 1"},null,null,{"$f":"'SpPl. Vorrd.'!AD61","v":14},{"$f":"'SpPl. Vorrd.'!AF61","v":10},{"$f":"'SpPl. Vorrd.'!AD98","v":8},{"$f":"'SpPl. Vorrd.'!AF98","v":9},{"$f":"'SpPl. Vorrd.'!AD55","v":9},{"$f":"'SpPl. Vorrd.'!AF55","v":11},{"$f":"'SpPl. Vorrd.'!AD19","v":19},{"$f":"'SpPl. Vorrd.'!AF19","v":8},{"$f":"'SpPl. Vorrd.'!AD28","v":6},{"$f":"'SpPl. Vorrd.'!AF28","v":18},{"$f":"'SpPl. Vorrd.'!AD40","v":17},{"$f":"'SpPl. Vorrd.'!AF40","v":10},{"$f":"'SpPl. Vorrd.'!AD84","v":12},{"$f":"'SpPl. Vorrd.'!AF84","v":14},{"$f":"'SpPl. Vorrd.'!AD77","v":16},{"$f":"'SpPl. Vorrd.'!AF77","v":10},{"$f":"SUM(C6,E6,G6,I6,K6,M6,O6,Q6,S6,)","v":101},{"$f":"SUM(D6,F6,H6,J6,L6,N6,P6,R6,T6,)","v":90},{"$f":"U7","v":8},6]
[{"$nulls":4},{"$f":"IF(E6>F6,2,IF(E6+F6=0,0,IF(E6=F6,1,0)))","v":2},{"$f":"IF(E6<F6,2,IF(E6+F6=0,0,IF(E6=F6,1,0)))","v":0},{"$f":"IF(G6>H6,2,IF(G6+H6=0,0,IF(G6=H6,1,0)))","v":0},{"$f":"IF(G6<H6,2,IF(G6+H6=0,0,IF(G6=H6,1,0)))","v":2},{"$f":"IF(I6>J6,2,IF(I6+J6=0,0,IF(I6=J6,1,0)))","v":0},{"$f":"IF(I6<J6,2,IF(I6+J6=0,0,IF(I6=J6,1,0)))","v":2},{"$f":"IF(K6>L6,2,IF(K6+L6=0,0,IF(K6=L6,1,0)))","v":2},{"$f":"IF(K6<L6,2,IF(K6+L6=0,0,IF(K6=L6,1,0)))","v":0},{"$f":"IF(M6>N6,2,IF(M6+N6=0,0,IF(M6=N6,1,0)))","v":0},{"$f":"IF(M6<N6,2,IF(M6+N6=0,0,IF(M6=N6,1,0)))","v":2},{"$f":"IF(O6>P6,2,IF(O6+P6=0,0,IF(O6=P6,1,0)))","v":2},{"$f":"IF(O6<P6,2,IF(O6+P6=0,0,IF(O6=P6,1,0)))","v":0},{"$f":"IF(Q6>R6,2,IF(Q6+R6=0,0,IF(Q6=R6,1,0)))","v":0},{"$f":"IF(Q6<R6,2,IF(Q6+R6=0,0,IF(Q6=R6,1,0)))","v":2},{"$f":"IF(S6>T6,2,IF(S6+T6=0,0,IF(S6=T6,1,0)))","v":2},{"$f":"IF(S6<T6,2,IF(S6+T6=0,0,IF(S6=T6,1,0)))","v":0},{"$f":"SUM(C7,E7,G7,I7,K7,M7,O7,Q7,S7)","v":8}]
[null,{"$f":"[1]Beschrieb!$C$7","v":"BSSV Köthen"},{"$f":"'SpPl. Vorrd.'!AF61","v":10},{"$f":"'SpPl. Vorrd.'!AD61","v":14},null,null,{"$f":"'SpPl. Vorrd.'!AD54","v":15},{"$f":"'SpPl. Vorrd.'!AF54","v":11},{"$f":"'SpPl. Vorrd.'!AD97","v":15},{"$f":"'SpPl. Vorrd.'!AF97","v":9},{"$f":"'SpPl. Vorrd.'!AD76","v":15},{"$f":"'SpPl. Vorrd.'!AF76","v":9},{"$f":"'SpPl. Vorrd.'!AD20","v":12},{"$f":"'SpPl. Vorrd.'!AF20","v":12},{"$f":"'SpPl. Vorrd.'!AD33","v":21},{"$f":"'SpPl. Vorrd.'!AF33","v":11},{"$f":"'SpPl. Vorrd.'!AD41","v":12},{"$f":"'SpPl. Vorrd.'!AF41","v":9},{"$f":"'SpPl. Vorrd.'!AD89","v":13},{"$f":"'SpPl. Vorrd.'!AF89","v":10},{"$f":"SUM(C8,E8,G8,I8,K8,M8,O8,Q8,S8,)","v":113},{"$f":"SUM(D8,F8,H8,J8,L8,N8,P8,R8,T8,)","v":85},{"$f":"U9","v":13},1]
[null,null,{"$f":"IF(C8>D8,2,IF(C8+D8=0,0,IF(C8=D8,1,0)))","v":0},{"$f":"IF(C8<D8,2,IF(C8+D8=0,0,IF(C8=D8,1,0)))","v":2},null,null,{"$f":"IF(G8>H8,2,IF(G8+H8=0,0,IF(G8=H8,1,0)))","v":2},{"$f":"IF(G8<H8,2,IF(G8+H8=0,0,IF(G8=H8,1,0)))","v":0},{"$f":"IF(I8>J8,2,IF(I8+J8=0,0,IF(I8=J8,1,0)))","v":2},{"$f":"IF(I8<J8,2,IF(I8+J8=0,0,IF(I8=J8,1,0)))","v":0},{"$f":"IF(K8>L8,2,IF(K8+L8=0,0,IF(K8=L8,1,0)))","v":2},{"$f":"IF(K8<L8,2,IF(K8+L8=0,0,IF(K8=L8,1,0)))","v":0},{"$f":"IF(M8>N8,2,IF(M8+N8=0,0,IF(M8=N8,1,0)))","v":1},{"$f":"IF(M8<N8,2,IF(M8+N8=0,0,IF(M8=N8,1,0)))","v":1},{"$f":"IF(O8>P8,2,IF(O8+P8=0,0,IF(O8=P8,1,0)))","v":2},{"$f":"IF(O8<P8,2,IF(O8+P8=0,0,IF(O8=P8,1,0)))","v":0},{"$f":"IF(Q8>R8,2,IF(Q8+R8=0,0,IF(Q8=R8,1,0)))","v":2},{"$f":"IF(Q8<R8,2,IF(Q8+R8=0,0,IF(Q8=R8,1,0)))","v":0},{"$f":"IF(S8>T8,2,IF(S8+T8=0,0,IF(S8=T8,1,0)))","v":2},{"$f":"IF(S8<T8,2,IF(S8+T8=0,0,IF(S8=T8,1,0)))","v":0},{"$f":"SUM(C9,E9,G9,I9,K9,M9,O9,Q9,S9)","v":13}]
[null,{"$f":"[1]Beschrieb!$C$8","v":"TV Markgröningen"},{"$f":"'SpPl. Vorrd.'!AF98","v":9},{"$f":"'SpPl. Vorrd.'!AD98","v":8},{"$f":"'SpPl. Vorrd.'!AF54","v":11},{"$f":"'SpPl. Vorrd.'!AD54","v":15},null,null,{"$f":"'SpPl. Vorrd.'!AD62","v":20},{"$f":"'SpPl. Vorrd.'!AF62","v":8},{"$f":"'SpPl. Vorrd.'!AD90","v":16},{"$f":"'SpPl. Vorrd.'!AF90","v":9},{"$f":"'SpPl. Vorrd.'!AD75","v":13},{"$f":"'SpPl. Vorrd.'!AF75","v":11},{"$f":"'SpPl. Vorrd.'!AD21","v":20},{"$f":"'SpPl. Vorrd.'!AF21","v":7},{"$f":"'SpPl. Vorrd.'!AD34","v":17},{"$f":"'SpPl. Vorrd.'!AF34","v":9},{"$f":"'SpPl. Vorrd.'!AD42","v":9},{"$f":"'SpPl. Vorrd.'!AF42","v":12},{"$f":"SUM(C10,E10,G10,I10,K10,M10,O10,Q10,S10,)","v":115},{"$f":"SUM(D10,F10,H10,J10,L10,N10,P10,R10,T10,)","v":79},{"$f":"U11","v":12},3]
[null,null,{"$f":"IF(C10>D10,2,IF(C10+D10=0,0,IF(C10=D10,1,0)))","v":2},{"$f":"IF(C10<D10,2,IF(C10+D10=0,0,IF(C10=D10,1,0)))","v":0},{"$f":"IF(E10>F10,2,IF(E10+F10=0,0,IF(E10=F10,1,0)))","v":0},{"$f":"IF(E10<F10,2,IF(E10+F10=0,0,IF(E10=F10,1,0)))","v":2},null,null,{"$f":"IF(I10>J10,2,IF(I10+J10=0,0,IF(I10=J10,1,0)))","v":2},{"$f":"IF(I10<J10,2,IF(I10+J10=0,0,IF(I10=J10,1,0)))","v":0},{"$f":"IF(K10>L10,2,IF(K10+L10=0,0,IF(K10=L10,1,0)))","v":2},{"$f":"IF(K10<L10,2,IF(K10+L10=0,0,IF(K10=L10,1,0)))","v":0},{"$f":"IF(M10>N10,2,IF(M10+N10=0,0,IF(M10=N10,1,0)))","v":2},{"$f":"IF(M10<N10,2,IF(M10+N10=0,0,IF(M10=N10,1,0)))","v":0},{"$f":"IF(O10>P10,2,IF(O10+P10=0,0,IF(O10=P10,1,0)))","v":2},{"$f":"IF(O10<P10,2,IF(O10+P10=0,0,IF(O10=P10,1,0)))","v":0},{"$f":"IF(Q10>R10,2,IF(Q10+R10=0,0,IF(Q10=R10,1,0)))","v":2},{"$f":"IF(Q10<R10,2,IF(Q10+R10=0,0,IF(Q10=R10,1,0)))","v":0},{"$f":"IF(S10>T10,2,IF(S10+T10=0,0,IF(S10=T10,1,0)))","v":0},{"$f":"IF(S10<T10,2,IF(S10+T10=0,0,IF(S10=T10,1,0)))","v":2},{"$f":"SUM(C11,E11,G11,I11,K11,M11,O11,Q11,S11)","v":12}]
[null,{"$f":"[1]Beschrieb!$C$9","v":"VSG Gelsenkirchen"},{"$f":"'SpPl. Vorrd.'!AF55","v":11},{"$f":"'SpPl. Vorrd.'!AD55","v":9},{"$f":"'SpPl. Vorrd.'!AF97","v":9},{"$f":"'SpPl. Vorrd.'!AD97","v":15},{"$f":"'SpPl. Vorrd.'!AF62","v":8},{"$f":"'SpPl. Vorrd.'!AD62","v":20},null,null,{"$f":"'SpPl. Vorrd.'!AD47","v":13},{"$f":"'SpPl. Vorrd.'!AF47","v":10},{"$f":"'SpPl. Vorrd.'!AD82","v":16},{"$f":"'SpPl. Vorrd.'!AF82","v":11},{"$f":"'SpPl. Vorrd.'!AD70","v":24},{"$f":"'SpPl. Vorrd.'!AF70","v":6},{"$f":"'SpPl. Vorrd.'!AD26","v":14},{"$f":"'SpPl. Vorrd.'!AF26","v":0},{"$f":"'SpPl. Vorrd.'!AD35","v":11},{"$f":"'SpPl. Vorrd.'!AF35","v":14},{"$f":"SUM(C12,E12,G12,I12,K12,M12,O12,Q12,S12,)","v":106},{"$f":"SUM(D12,F12,H12,J12,L12,N12,P12,R12,T12,)","v":85},{"$f":"U13","v":10},4]
[null,null,{"$f":"IF(C12>D12,2,IF(C12+D12=0,0,IF(C12=D12,1,0)))","v":2},{"$f":"IF(C12<D12,2,IF(C12+D12=0,0,IF(C12=D12,1,0)))","v":0},{"$f":"IF(E12>F12,2,IF(E12+F12=0,0,IF(E12=F12,1,0)))","v":0},{"$f":"IF(E12<F12,2,IF(E12+F12=0,0,IF(E12=F12,1,0)))","v":2},{"$f":"IF(G12>H12,2,IF(G12+H12=0,0,IF(G12=H12,1,0)))","v":0},{"$f":"IF(G12<H12,2,IF(G12+H12=0,0,IF(G12=H12,1,0)))","v":2},null,null,{"$f":"IF(K12>L12,2,IF(K12+L12=0,0,IF(K12=L12,1,0)))","v":2},{"$f":"IF(K12<L12,2,IF(K12+L12=0,0,IF(K12=L12,1,0)))","v":0},{"$f":"IF(M12>N12,2,IF(M12+N12=0,0,IF(M12=N12,1,0)))","v":2},{"$f":"IF(M12<N12,2,IF(M12+N12=0,0,IF(M12=N12,1,0)))","v":0},{"$f":"IF(O12>P12,2,IF(O12+P12=0,0,IF(O12=P12,1,0)))","v":2},{"$f":"IF(O12<P12,2,IF(O12+P12=0,0,IF(O12=P12,1,0)))","v":0},{"$f":"IF(Q12>R12,2,IF(Q12+R12=0,0,IF(Q12=R12,1,0)))","v":2},{"$f":"IF(Q12<R12,2,IF(Q12+R12=0,0,IF(Q12=R12,1,0)))","v":0},{"$f":"IF(S12>T12,2,IF(S12+T12=0,0,IF(S12=T12,1,0)))","v":0},{"$f":"IF(S12<T12,2,IF(S12+T12=0,0,IF(S12=T12,1,0)))","v":2},{"$f":"SUM(C13,E13,G13,I13,K13,M13,O13,Q13,S13)","v":10}]
[null,{"$f":"[1]Beschrieb!$D$6","v":"ZGS Berlin"},{"$f":"'SpPl. Vorrd.'!AF19","v":8},{"$f":"'SpPl. Vorrd.'!AD19","v":19},{"$f":"'SpPl. Vorrd.'!AF76","v":9},{"$f":"'SpPl. Vorrd.'!AD76","v":15},{"$f":"'SpPl. Vorrd.'!AF90","v":9},{"$f":"'SpPl. Vorrd.'!AD90","v":16},{"$f":"'SpPl. Vorrd.'!AF47","v":10},{"$f":"'SpPl. Vorrd.'!AD47","v":13},null,null,{"$f":"'SpPl. Vorrd.'!AD56","v":11},{"$f":"'SpPl. Vorrd.'!AF56","v":8},{"$f":"'SpPl. Vorrd.'!AD83","v":12},{"$f":"'SpPl. Vorrd.'!AF83","v":10},{"$f":"'SpPl. Vorrd.'!AD69","v":7},{"$f":"'SpPl. Vorrd.'!AF69","v":15},{"$f":"'SpPl. Vorrd.'!AD27","v":7},{"$f":"'SpPl. Vorrd.'!AF27","v":16},{"$f":"SUM(C14,E14,G14,I14,K14,M14,O14,Q14,S14,)","v":73},{"$f":"SUM(D14,F14,H14,J14,L14,N14,P14,R14,T14,)","v":112},{"$f":"U15","v":4},7]
[null,null,{"$f":"IF(C14>D14,2,IF(C14+D14=0,0,IF(C14=D14,1,0)))","v":0},{"$f":"IF(C14<D14,2,IF(C14+D14=0,0,IF(C14=D14,1,0)))","v":2},{"$f":"IF(E14>F14,2,IF(E14+F14=0,0,IF(E14=F14,1,0)))","v":0},{"$f":"IF(E14<F14,2,IF(E14+F14=0,0,IF(E14=F14,1,0)))","v":2},{"$f":"IF(G14>H14,2,IF(G14+H14=0,0,IF(G14=H14,1,0)))","v":0},{"$f":"IF(G14<H14,2,IF(G14+H14=0,0,IF(G14=H14,1,0)))","v":2},{"$f":"IF(I14>J14,2,IF(I14+J14=0,0,IF(I14=J14,1,0)))","v":0},{"$f":"IF(I14<J14,2,IF(I14+J14=0,0,IF(I14=J14,1,0)))","v":2},null,null,{"$f":"IF(M14>N14,2,IF(M14+N14=0,0,IF(M14=N14,1,0)))","v":2},{"$f":"IF(M14<N14,2,IF(M14+N14=0,0,IF(M14=N14,1,0)))","v":0},{"$f":"IF(O14>P14,2,IF(O14+P14=0,0,IF(O14=P14,1,0)))","v":2},{"$f":"IF(O14<P14,2,IF(O14+P14=0,0,IF(O14=P14,1,0)))","v":0},{"$f":"IF(Q14>R14,2,IF(Q14+R14=0,0,IF(Q14=R14,1,0)))","v":0},{"$f":"IF(Q14<R14,2,IF(Q14+R14=0,0,IF(Q14=R14,1,0)))","v":2},{"$f":"IF(S14>T14,2,IF(S14+T14=0,0,IF(S14=T14,1,0)))","v":0},{"$f":"IF(S14<T14,2,IF(S14+T14=0,0,IF(S14=T14,1,0)))","v":2},{"$f":"SUM(C15,E15,G15,I15,K15,M15,O15,Q15,S15)","v":4}]
[null,{"$f":"[1]Beschrieb!$D$7","v":"Rh. Wiesbaden 2"},{"$f":"'SpPl. Vorrd.'!AF28","v":18},{"$f":"'SpPl. Vorrd.'!AD28","v":6},{"$f":"'SpPl. Vorrd.'!AF20","v":12},{"$f":"'SpPl. Vorrd.'!AD20","v":12},{"$f":"'SpPl. Vorrd.'!AF75","v":11},{"$f":"'SpPl. Vorrd.'!AD75","v":13},{"$f":"'SpPl. Vorrd.'!AF82","v":11},{"$f":"'SpPl. Vorrd.'!AD82","v":16},{"$f":"'SpPl. Vorrd.'!AF56","v":8},{"$f":"'SpPl. Vorrd.'!AD56","v":11},null,null,{"$f":"'SpPl. Vorrd.'!AD48","v":9},{"$f":"'SpPl. Vorrd.'!AF48","v":11},{"$f":"'SpPl. Vorrd.'!AD91","v":7},{"$f":"'SpPl. Vorrd.'!AF91","v":14},{"$f":"'SpPl. Vorrd.'!AD68","v":8},{"$f":"'SpPl. Vorrd.'!AF68","v":19},{"$f":"SUM(C16,E16,G16,I16,K16,M16,O16,Q16,S16,)","v":84},{"$f":"SUM(D16,F16,H16,J16,L16,N16,P16,R16,T16,)","v":102},{"$f":"U17","v":3},8]
[null,null,{"$f":"IF(C16>D16,2,IF(C16+D16=0,0,IF(C16=D16,1,0)))","v":2},{"$f":"IF(C16<D16,2,IF(C16+D16=0,0,IF(C16=D16,1,0)))","v":0},{"$f":"IF(E16>F16,2,IF(E16+F16=0,0,IF(E16=F16,1,0)))","v":1},{"$f":"IF(E16<F16,2,IF(E16+F16=0,0,IF(E16=F16,1,0)))","v":1},{"$f":"IF(G16>H16,2,IF(G16+H16=0,0,IF(G16=H16,1,0)))","v":0},{"$f":"IF(G16<H16,2,IF(G16+H16=0,0,IF(G16=H16,1,0)))","v":2},{"$f":"IF(I16>J16,2,IF(I16+J16=0,0,IF(I16=J16,1,0)))","v":0},{"$f":"IF(I16<J16,2,IF(I16+J16=0,0,IF(I16=J16,1,0)))","v":2},{"$f":"IF(K16>L16,2,IF(K16+L16=0,0,IF(K16=L16,1,0)))","v":0},{"$f":"IF(K16<L16,2,IF(K16+L16=0,0,IF(K16=L16,1,0)))","v":2},null,null,{"$f":"IF(O16>P16,2,IF(O16+P16=0,0,IF(O16=P16,1,0)))","v":0},{"$f":"IF(O16<P16,2,IF(O16+P16=0,0,IF(O16=P16,1,0)))","v":2},{"$f":"IF(Q16>R16,2,IF(Q16+R16=0,0,IF(Q16=R16,1,0)))","v":0},{"$f":"IF(Q16<R16,2,IF(Q16+R16=0,0,IF(Q16=R16,1,0)))","v":2},{"$f":"IF(S16>T16,2,IF(S16+T16=0,0,IF(S16=T16,1,0)))","v":0},{"$f":"IF(S16<T16,2,IF(S16+T16=0,0,IF(S16=T16,1,0)))","v":2},{"$f":"SUM(C17,E17,G17,I17,K17,M17,O17,Q17,S17)","v":3}]
[null,{"$f":"[1]Beschrieb!$D$8","v":"BSG Offenburg"},{"$f":"'SpPl. Vorrd.'!AF40","v":10},{"$f":"'SpPl. Vorrd.'!AD40","v":17},{"$f":"'SpPl. Vorrd.'!AF33","v":11},{"$f":"'SpPl. Vorrd.'!AD33","v":21},{"$f":"'SpPl. Vorrd.'!AF21","v":7},{"$f":"'SpPl. Vorrd.'!AD21","v":20},{"$f":"'SpPl. Vorrd.'!AF70","v":6},{"$f":"'SpPl. Vorrd.'!AD70","v":24},{"$f":"'SpPl. Vorrd.'!AF83","v":10},{"$f":"'SpPl. Vorrd.'!AD83","v":12},{"$f":"'SpPl. Vorrd.'!AF48","v":11},{"$f":"'SpPl. Vorrd.'!AD48","v":9},null,null,{"$f":"'SpPl. Vorrd.'!AD63","v":8},{"$f":"'SpPl. Vorrd.'!AF63","v":19},{"$f":"'SpPl. Vorrd.'!AD96","v":8},{"$f":"'SpPl. Vorrd.'!AF96","v":25},{"$f":"SUM(C18,E18,G18,I18,K18,M18,O18,Q18,S18,)","v":71},{"$f":"SUM(D18,F18,H18,J18,L18,N18,P18,R18,T18,)","v":147},{"$f":"U19","v":2},9]
[null,null,{"$f":"IF(C18>D18,2,IF(C18+D18=0,0,IF(C18=D18,1,0)))","v":0},{"$f":"IF(C18<D18,2,IF(C18+D18=0,0,IF(C18=D18,1,0)))","v":2},{"$f":"IF(E18>F18,2,IF(E18+F18=0,0,IF(E18=F18,1,0)))","v":0},{"$f":"IF(E18<F18,2,IF(E18+F18=0,0,IF(E18=F18,1,0)))","v":2},{"$f":"IF(G18>H18,2,IF(G18+H18=0,0,IF(G18=H18,1,0)))","v":0},{"$f":"IF(G18<H18,2,IF(G18+H18=0,0,IF(G18=H18,1,0)))","v":2},{"$f":"IF(I18>J18,2,IF(I18+J18=0,0,IF(I18=J18,1,0)))","v":0},{"$f":"IF(I18<J18,2,IF(I18+J18=0,0,IF(I18=J18,1,0)))","v":2},{"$f":"IF(K18>L18,2,IF(K18+L18=0,0,IF(K18=L18,1,0)))","v":0},{"$f":"IF(K18<L18,2,IF(K18+L18=0,0,IF(K18=L18,1,0)))","v":2},{"$f":"IF(M18>N18,2,IF(M18+N18=0,0,IF(M18=N18,1,0)))","v":2},{"$f":"IF(M18<N18,2,IF(M18+N18=0,0,IF(M18=N18,1,0)))","v":0},null,null,{"$f":"IF(Q18>R18,2,IF(Q18+R18=0,0,IF(Q18=R18,1,0)))","v":0},{"$f":"IF(Q18<R18,2,IF(Q18+R18=0,0,IF(Q18=R18,1,0)))","v":2},{"$f":"IF(S18>T18,2,IF(S18+T18=0,0,IF(S18=T18,1,0)))","v":0},{"$f":"IF(S18<T18,2,IF(S18+T18=0,0,IF(S18=T18,1,0)))","v":2},{"$f":"SUM(C19,E19,G19,I19,K19,M19,O19,Q19,S19)","v":2}]
[null,{"$f":"[1]Beschrieb!$D$9","v":"RSG Partenstein"},{"$f":"'SpPl. Vorrd.'!AF84","v":14},{"$f":"'SpPl. Vorrd.'!AD84","v":12},{"$f":"'SpPl. Vorrd.'!AF41","v":9},{"$f":"'SpPl. Vorrd.'!AD41","v":12},{"$f":"'SpPl. Vorrd.'!AF34","v":9},{"$f":"'SpPl. Vorrd.'!AD34","v":17},{"$f":"'SpPl. Vorrd.'!AF26","v":0},{"$f":"'SpPl. Vorrd.'!AD26","v":14},{"$f":"'SpPl. Vorrd.'!AF69","v":15},{"$f":"'SpPl. Vorrd.'!AD69","v":7},{"$f":"'SpPl. Vorrd.'!AF91","v":14},{"$f":"'SpPl. Vorrd.'!AD91","v":7},{"$f":"'SpPl. Vorrd.'!AF63","v":19},{"$f":"'SpPl. Vorrd.'!AD63","v":8},null,null,{"$f":"'SpPl. Vorrd.'!AD49","v":11},{"$f":"'SpPl. Vorrd.'!AF49","v":15},{"$f":"SUM(C20,E20,G20,I20,K20,M20,O20,Q20,S20,)","v":91},{"$f":"SUM(D20,F20,H20,J20,L20,N20,P20,R20,T20,)","v":92},{"$f":"U21","v":8},5]
[null,null,{"$f":"IF(C20>D20,2,IF(C20+D20=0,0,IF(C20=D20,1,0)))","v":2},{"$f":"IF(C20<D20,2,IF(C20+D20=0,0,IF(C20=D20,1,0)))","v":0},{"$f":"IF(E20>F20,2,IF(E20+F20=0,0,IF(E20=F20,1,0)))","v":0},{"$f":"IF(E20<F20,2,IF(E20+F20=0,0,IF(E20=F20,1,0)))","v":2},{"$f":"IF(G20>H20,2,IF(G20+H20=0,0,IF(G20=H20,1,0)))","v":0},{"$f":"IF(G20<H20,2,IF(G20+H20=0,0,IF(G20=H20,1,0)))","v":2},{"$f":"IF(I20>J20,2,IF(I20+J20=0,0,IF(I20=J20,1,0)))","v":0},{"$f":"IF(I20<J20,2,IF(I20+J20=0,0,IF(I20=J20,1,0)))","v":2},{"$f":"IF(K20>L20,2,IF(K20+L20=0,0,IF(K20=L20,1,0)))","v":2},{"$f":"IF(K20<L20,2,IF(K20+L20=0,0,IF(K20=L20,1,0)))","v":0},{"$f":"IF(M20>N20,2,IF(M20+N20=0,0,IF(M20=N20,1,0)))","v":2},{"$f":"IF(M20<N20,2,IF(M20+N20=0,0,IF(M20=N20,1,0)))","v":0},{"$f":"IF(O20>P20,2,IF(O20+P20=0,0,IF(O20=P20,1,0)))","v":2},{"$f":"IF(O20<P20,2,IF(O20+P20=0,0,IF(O20=P20,1,0)))","v":0},null,null,{"$f":"IF(S20>T20,2,IF(S20+T20=0,0,IF(S20=T20,1,0)))","v":0},{"$f":"IF(S20<T20,2,IF(S20+T20=0,0,IF(S20=T20,1,0)))","v":2},{"$f":"SUM(C21,E21,G21,I21,K21,M21,O21,Q21,S21)","v":8}]
[null,{"$f":"[1]Beschrieb!$D$10","v":"BVS Weiden"},{"$f":"'SpPl. Vorrd.'!AF77","v":10},{"$f":"'SpPl. Vorrd.'!AD77","v":16},{"$f":"'SpPl. Vorrd.'!AF89","v":10},{"$f":"'SpPl. Vorrd.'!AD89","v":13},{"$f":"'SpPl. Vorrd.'!AF42","v":12},{"$f":"'SpPl. Vorrd.'!AD42","v":9},{"$f":"'SpPl. Vorrd.'!AF35","v":14},{"$f":"'SpPl. Vorrd.'!AD35","v":11},{"$f":"'SpPl. Vorrd.'!AF27","v":16},{"$f":"'SpPl. Vorrd.'!AD27","v":7},{"$f":"'SpPl. Vorrd.'!AF68","v":19},{"$f":"'SpPl. Vorrd.'!AD68","v":8},{"$f":"'SpPl. Vorrd.'!AF96","v":25},{"$f":"'SpPl. Vorrd.'!AD96","v":8},{"$f":"'SpPl. Vorrd.'!AF49","v":15},{"$f":"'SpPl. Vorrd.'!AD49","v":11},null,null,{"$f":"SUM(C22,E22,G22,I22,K22,M22,O22,Q22,S22,)","v":121},{"$f":"SUM(D22,F22,H22,J22,L22,N22,P22,R22,T22,)","v":83},{"$f":"U23","v":12},2]
[null,null,{"$f":"IF(C22>D22,2,IF(C22+D22=0,0,IF(C22=D22,1,0)))","v":0},{"$f":"IF(C22<D22,2,IF(C22+D22=0,0,IF(C22=D22,1,0)))","v":2},{"$f":"IF(E22>F22,2,IF(E22+F22=0,0,IF(E22=F22,1,0)))","v":0},{"$f":"IF(E22<F22,2,IF(E22+F22=0,0,IF(E22=F22,1,0)))","v":2},{"$f":"IF(G22>H22,2,IF(G22+H22=0,0,IF(G22=H22,1,0)))","v":2},{"$f":"IF(G22<H22,2,IF(G22+H22=0,0,IF(G22=H22,1,0)))","v":0},{"$f":"IF(I22>J22,2,IF(I22+J22=0,0,IF(I22=J22,1,0)))","v":2},{"$f":"IF(I22<J22,2,IF(I22+J22=0,0,IF(I22=J22,1,0)))","v":0},{"$f":"IF(K22>L22,2,IF(K22+L22=0,0,IF(K22=L22,1,0)))","v":2},{"$f":"IF(K22<L22,2,IF(K22+L22=0,0,IF(K22=L22,1,0)))","v":0},{"$f":"IF(M22>N22,2,IF(M22+N22=0,0,IF(M22=N22,1,0)))","v":2},{"$f":"IF(M22<N22,2,IF(M22+N22=0,0,IF(M22=N22,1,0)))","v":0},{"$f":"IF(O22>P22,2,IF(O22+P22=0,0,IF(O22=P22,1,0)))","v":2},{"$f":"IF(O22<P22,2,IF(O22+P22=0,0,IF(O22=P22,1,0)))","v":0},{"$f":"IF(Q22>R22,2,IF(Q22+R22=0,0,IF(Q22=R22,1,0)))","v":2},{"$f":"IF(Q22<R22,2,IF(Q22+R22=0,0,IF(Q22=R22,1,0)))","v":0},null,null,{"$f":"SUM(C23,E23,G23,I23,K23,M23,O23,Q23,S23)","v":12}]
[]
[]
[]
[null,null,null,{"$f":"[1]Beschrieb!$C$1","v":"19. Deutsche Meisterschft im Boccia (Halle)"}]
["Vereine",null,{"$f":"[1]Beschrieb!$E$6","v":"Rhinos Wiesbaden 1"},null,{"$f":"[1]Beschrieb!E7","v":"VSG Stadthagen"},null,{"$f":"[1]Beschrieb!E8","v":"BSG Nordwalde"},null,{"$f":"[1]Beschrieb!E9","v":"BRS Gersweiler 2"},null,{"$f":"[1]Beschrieb!F6","v":"        BRV Berlin"},null,{"$f":"[1]Beschrieb!F7","v":"        Rh. Leipzig"},null,{"$f":"[1]Beschrieb!F8","v":"        Grevesmühlen"},null,{"$f":"[1]Beschrieb!F9","v":"        RBA Neumarkt"},null,{"$f":"[1]Beschrieb!F10","v":"        BSG Mettmann"},null,"Treffer",null,"Pluspunkte","Platz"]
[{"$nulls":20},"Punkte"]
[null,null,"+","-"," ","-","+","-","+","-","+","-","+","-","+","-","+","-","+","-","+","-"]
[null,{"$f":"[1]Beschrieb!$E$6","v":"Rhinos Wiesbaden 1"},null,null,{"$f":"'SpPl. Vorrd.'!AD64","v":8},{"$f":"'SpPl. Vorrd.'!AF64","v":13},{"$f":"'SpPl. Vorrd.'!AD101","v":18},{"$f":"'SpPl. Vorrd.'!AF101","v":7},{"$f":"'SpPl. Vorrd.'!AD58","v":9},{"$f":"'SpPl. Vorrd.'!AF58","v":14},{"$f":"'SpPl. Vorrd.'!AD22","v":13},{"$f":"'SpPl. Vorrd.'!AF22","v":11},{"$f":"'SpPl. Vorrd.'!AD31","v":9},{"$f":"'SpPl. Vorrd.'!AF31","v":7},{"$f":"'SpPl. Vorrd.'!AD43","v":10},{"$f":"'SpPl. Vorrd.'!AF43","v":12},{"$f":"'SpPl. Vorrd.'!AD87","v":10},{"$f":"'SpPl. Vorrd.'!AF87","v":9},{"$f":"'SpPl. Vorrd.'!AD80","v":9},{"$f":"'SpPl. Vorrd.'!AF80","v":12},{"$f":"SUM(C31,E31,G31,I31,K31,M31,O31,Q31,S31,)","v":86},{"$f":"SUM(D31,F31,H31,J31,L31,N31,P31,R31,T31,)","v":85},{"$f":"U32","v":8},6]
[{"$nulls":4},{"$f":"IF(E31>F31,2,IF(E31+F31=0,0,IF(E31=F31,1,0)))","v":0},{"$f":"IF(E31<F31,2,IF(E31+F31=0,0,IF(E31=F31,1,0)))","v":2},{"$f":"IF(G31>H31,2,IF(G31+H31=0,0,IF(G31=H31,1,0)))","v":2},{"$f":"IF(G31<H31,2,IF(G31+H31=0,0,IF(G31=H31,1,0)))","v":0},{"$f":"IF(I31>J31,2,IF(I31+J31=0,0,IF(I31=J31,1,0)))","v":0},{"$f":"IF(I31<J31,2,IF(I31+J31=0,0,IF(I31=J31,1,0)))","v":2},{"$f":"IF(K31>L31,2,IF(K31+L31=0,0,IF(K31=L31,1,0)))","v":2},{"$f":"IF(K31<L31,2,IF(K31+L31=0,0,IF(K31=L31,1,0)))","v":0},{"$f":"IF(M31>N31,2,IF(M31+N31=0,0,IF(M31=N31,1,0)))","v":2},{"$f":"IF(M31<N31,2,IF(M31+N31=0,0,IF(M31=N31,1,0)))","v":0},{"$f":"IF(O31>P31,2,IF(O31+P31=0,0,IF(O31=P31,1,0)))","v":0},{"$f":"IF(O31<P31,2,IF(O31+P31=0,0,IF(O31=P31,1,0)))","v":2},{"$f":"IF(Q31>R31,2,IF(Q31+R31=0,0,IF(Q31=R31,1,0)))","v":2},{"$f":"IF(Q31<R31,2,IF(Q31+R31=0,0,IF(Q31=R31,1,0)))","v":0},{"$f":"IF(S31>T31,2,IF(S31+T31=0,0,IF(S31=T31,1,0)))","v":0},{"$f":"IF(S31<T31,2,IF(S31+T31=0,0,IF(S31=T31,1,0)))","v":2},{"$f":"SUM(C32,E32,G32,I32,K32,M32,O32,Q32,S32)","v":8}]
[null,{"$f":"[1]Beschrieb!$E$7","v":"VSG Stadthagen"},{"$f":"'SpPl. Vorrd.'!AF64","v":13},{"$f":"'SpPl. Vorrd.'!AD64","v":8},null,null,{"$f":"'SpPl. Vorrd.'!AD57","v":11},{"$f":"'SpPl. Vorrd.'!AF57","v":14},{"$f":"'SpPl. Vorrd.'!AD100","v":8},{"$f":"'SpPl. Vorrd.'!AF100","v":15},{"$f":"'SpPl. Vorrd.'!AD79","v":11},{"$f":"'SpPl. Vorrd.'!AF79","v":13},{"$f":"'SpPl. Vorrd.'!AD23","v":20},{"$f":"'SpPl. Vorrd.'!AF23","v":6},{"$f":"'SpPl. Vorrd.'!AD36","v":15},{"$f":"'SpPl. Vorrd.'!AF36","v":9},{"$f":"'SpPl. Vorrd.'!AD44","v":9},{"$f":"'SpPl. Vorrd.'!AF44","v":10},{"$f":"'SpPl. Vorrd.'!AD92","v":13},{"$f":"'SpPl. Vorrd.'!AF92","v":11},{"$f":"SUM(C33,E33,G33,I33,K33,M33,O33,Q33,S33,)","v":100},{"$f":"SUM(D33,F33,H33,J33,L33,N33,P33,R33,T33,)","v":86},{"$f":"U34","v":8},4]
[null,null,{"$f":"IF(C33>D33,2,IF(C33+D33=0,0,IF(C33=D33,1,0)))","v":2},{"$f":"IF(C33<D33,2,IF(C33+D33=0,0,IF(C33=D33,1,0)))","v":0},null,null,{"$f":"IF(G33>H33,2,IF(G33+H33=0,0,IF(G33=H33,1,0)))","v":0},{"$f":"IF(G33<H33,2,IF(G33+H33=0,0,IF(G33=H33,1,0)))","v":2},{"$f":"IF(I33>J33,2,IF(I33+J33=0,0,IF(I33=J33,1,0)))","v":0},{"$f":"IF(I33<J33,2,IF(I33+J33=0,0,IF(I33=J33,1,0)))","v":2},{"$f":"IF(K33>L33,2,IF(K33+L33=0,0,IF(K33=L33,1,0)))","v":0},{"$f":"IF(K33<L33,2,IF(K33+L33=0,0,IF(K33=L33,1,0)))","v":2},{"$f":"IF(M33>N33,2,IF(M33+N33=0,0,IF(M33=N33,1,0)))","v":2},{"$f":"IF(M33<N33,2,IF(M33+N33=0,0,IF(M33=N33,1,0)))","v":0},{"$f":"IF(O33>P33,2,IF(O33+P33=0,0,IF(O33=P33,1,0)))","v":2},{"$f":"IF(O33<P33,2,IF(O33+P33=0,0,IF(O33=P33,1,0)))","v":0},{"$f":"IF(Q33>R33,2,IF(Q33+R33=0,0,IF(Q33=R33,1,0)))","v":0},{"$f":"IF(Q33<R33,2,IF(Q33+R33=0,0,IF(Q33=R33,1,0)))","v":2},{"$f":"IF(S33>T33,2,IF(S33+T33=0,0,IF(S33=T33,1,0)))","v":2},{"$f":"IF(S33<T33,2,IF(S33+T33=0,0,IF(S33=T33,1,0)))","v":0},{"$f":"SUM(C34,E34,G34,I34,K34,M34,O34,Q34,S34)","v":8}]
[null,{"$f":"[1]Beschrieb!$E$8","v":"BSG Nordwalde"},{"$f":"'SpPl. Vorrd.'!AF101","v":7},{"$f":"'SpPl. Vorrd.'!AD101","v":18},{"$f":"'SpPl. Vorrd.'!AF57","v":14},{"$f":"'SpPl. Vorrd.'!AD57","v":11},null,null,{"$f":"'SpPl. Vorrd.'!AD65","v":8},{"$f":"'SpPl. Vorrd.'!AF65","v":7},{"$f":"'SpPl. Vorrd.'!AD93","v":11},{"$f":"'SpPl. Vorrd.'!AF93","v":9},{"$f":"'SpPl. Vorrd.'!AD78","v":20},{"$f":"'SpPl. Vorrd.'!AF78","v":4},{"$f":"'SpPl. Vorrd.'!AD24","v":17},{"$f":"'SpPl. Vorrd.'!AF24","v":9},{"$f":"'SpPl. Vorrd.'!AD37","v":5},{"$f":"'SpPl. Vorrd.'!AF37","v":19},{"$f":"'SpPl. Vorrd.'!AD45","v":8},{"$f":"'SpPl. Vorrd.'!AF45","v":12},{"$f":"SUM(C35,E35,G35,I35,K35,M35,O35,Q35,S35,)","v":90},{"$f":"SUM(D35,F35,H35,J35,L35,N35,P35,R35,T35,)","v":89},{"$f":"U36","v":10},3]
[null,null,{"$f":"IF(C35>D35,2,IF(C35+D35=0,0,IF(C35=D35,1,0)))","v":0},{"$f":"IF(C35<D35,2,IF(C35+D35=0,0,IF(C35=D35,1,0)))","v":2},{"$f":"IF(E35>F35,2,IF(E35+F35=0,0,IF(E35=F35,1,0)))","v":2},{"$f":"IF(E35<F35,2,IF(E35+F35=0,0,IF(E35=F35,1,0)))","v":0},null,null,{"$f":"IF(I35>J35,2,IF(I35+J35=0,0,IF(I35=J35,1,0)))","v":2},{"$f":"IF(I35<J35,2,IF(I35+J35=0,0,IF(I35=J35,1,0)))","v":0},{"$f":"IF(K35>L35,2,IF(K35+L35=0,0,IF(K35=L35,1,0)))","v":2},{"$f":"IF(K35<L35,2,IF(K35+L35=0,0,IF(K35=L35,1,0)))","v":0},{"$f":"IF(M35>N35,2,IF(M35+N35=0,0,IF(M35=N35,1,0)))","v":2},{"$f":"IF(M35<N35,2,IF(M35+N35=0,0,IF(M35=N35,1,0)))","v":0},{"$f":"IF(O35>P35,2,IF(O35+P35=0,0,IF(O35=P35,1,0)))","v":2},{"$f":"IF(O35<P35,2,IF(O35+P35=0,0,IF(O35=P35,1,0)))","v":0},{"$f":"IF(Q35>R35,2,IF(Q35+R35=0,0,IF(Q35=R35,1,0)))","v":0},{"$f":"IF(Q35<R35,2,IF(Q35+R35=0,0,IF(Q35=R35,1,0)))","v":2},{"$f":"IF(S35>T35,2,IF(S35+T35=0,0,IF(S35=T35,1,0)))","v":0},{"$f":"IF(S35<T35,2,IF(S35+T35=0,0,IF(S35=T35,1,0)))","v":2},{"$f":"SUM(C36,E36,G36,I36,K36,M36,O36,Q36,S36)","v":10}]
[null,{"$f":"[1]Beschrieb!$E$9","v":"BRS Gersweiler 2"},{"$f":"'SpPl. Vorrd.'!AF58","v":14},{"$f":"'SpPl. Vorrd.'!AD58","v":9},{"$f":"'SpPl. Vorrd.'!AF100","v":15},{"$f":"'SpPl. Vorrd.'!AD100","v":8},{"$f":"'SpPl. Vorrd.'!AF65","v":7},{"$f":"'SpPl. Vorrd.'!AD65","v":8},null,null,{"$f":"'SpPl. Vorrd.'!AD50","v":14},{"$f":"'SpPl. Vorrd.'!AF50","v":10},{"$f":"'SpPl. Vorrd.'!AD85","v":15},{"$f":"'SpPl. Vorrd.'!AF85","v":8},{"$f":"'SpPl. Vorrd.'!AD73","v":11},{"$f":"'SpPl. Vorrd.'!AF73","v":11},{"$f":"'SpPl. Vorrd.'!AD29","v":13},{"$f":"'SpPl. Vorrd.'!AF29","v":5},{"$f":"'SpPl. Vorrd.'!AD38","v":13},{"$f":"'SpPl. Vorrd.'!AF38","v":10},{"$f":"SUM(C37,E37,G37,I37,K37,M37,O37,Q37,S37,)","v":102},{"$f":"SUM(D37,F37,H37,J37,L37,N37,P37,R37,T37,)","v":69},{"$f":"U38","v":13},1]
[null,null,{"$f":"IF(C37>D37,2,IF(C37+D37=0,0,IF(C37=D37,1,0)))","v":2},{"$f":"IF(C37<D37,2,IF(C37+D37=0,0,IF(C37=D37,1,0)))","v":0},{"$f":"IF(E37>F37,2,IF(E37+F37=0,0,IF(E37=F37,1,0)))","v":2},{"$f":"IF(E37<F37,2,IF(E37+F37=0,0,IF(E37=F37,1,0)))","v":0},{"$f":"IF(G37>H37,2,IF(G37+H37=0,0,IF(G37=H37,1,0)))","v":0},{"$f":"IF(G37<H37,2,IF(G37+H37=0,0,IF(G37=H37,1,0)))","v":2},null,null,{"$f":"IF(K37>L37,2,IF(K37+L37=0,0,IF(K37=L37,1,0)))","v":2},{"$f":"IF(K37<L37,2,IF(K37+L37=0,0,IF(K37=L37,1,0)))","v":0},{"$f":"IF(M37>N37,2,IF(M37+N37=0,0,IF(M37=N37,1,0)))","v":2},{"$f":"IF(M37<N37,2,IF(M37+N37=0,0,IF(M37=N37,1,0)))","v":0},{"$f":"IF(O37>P37,2,IF(O37+P37=0,0,IF(O37=P37,1,0)))","v":1},{"$f":"IF(O37<P37,2,IF(O37+P37=0,0,IF(O37=P37,1,0)))","v":1},{"$f":"IF(Q37>R37,2,IF(Q37+R37=0,0,IF(Q37=R37,1,0)))","v":2},{"$f":"IF(Q37<R37,2,IF(Q37+R37=0,0,IF(Q37=R37,1,0)))","v":0},{"$f":"IF(S37>T37,2,IF(S37+T37=0,0,IF(S37=T37,1,0)))","v":2},{"$f":"IF(S37<T37,2,IF(S37+T37=0,0,IF(S37=T37,1,0)))","v":0},{"$f":"SUM(C38,E38,G38,I38,K38,M38,O38,Q38,S38)","v":13}]
[null,{"$f":"[1]Beschrieb!$F$6","v":"        BRV Berlin"},{"$f":"'SpPl. Vorrd.'!AF22","v":11},{"$f":"'SpPl. Vorrd.'!AD22","v":13},{"$f":"'SpPl. Vorrd.'!AF79","v":13},{"$f":"'SpPl. Vorrd.'!AD79","v":11},{"$f":"'SpPl. Vorrd.'!AF93","v":9},{"$f":"'SpPl. Vorrd.'!AD93","v":11},{"$f":"'SpPl. Vorrd.'!AF50","v":10},{"$f":"'SpPl. Vorrd.'!AD50","v":14},null,null,{"$f":"'SpPl. Vorrd.'!AD59","v":8},{"$f":"'SpPl. Vorrd.'!AF59","v":11},{"$f":"'SpPl. Vorrd.'!AD86","v":14},{"$f":"'SpPl. Vorrd.'!AF86","v":15},{"$f":"'SpPl. Vorrd.'!AD72","v":7},{"$f":"'SpPl. Vorrd.'!AF72","v":17},{"$f":"'SpPl. Vorrd.'!AD30","v":7},{"$f":"'SpPl. Vorrd.'!AF30","v":18},{"$f":"SUM(C39,E39,G39,I39,K39,M39,O39,Q39,S39,)","v":79},{"$f":"SUM(D39,F39,H39,J39,L39,N39,P39,R39,T39,)","v":110},{"$f":"U40","v":2},9]
[null,null,{"$f":"IF(C39>D39,2,IF(C39+D39=0,0,IF(C39=D39,1,0)))","v":0},{"$f":"IF(C39<D39,2,IF(C39+D39=0,0,IF(C39=D39,1,0)))","v":2},{"$f":"IF(E39>F39,2,IF(E39+F39=0,0,IF(E39=F39,1,0)))","v":2},{"$f":"IF(E39<F39,2,IF(E39+F39=0,0,IF(E39=F39,1,0)))","v":0},{"$f":"IF(G39>H39,2,IF(G39+H39=0,0,IF(G39=H39,1,0)))","v":0},{"$f":"IF(G39<H39,2,IF(G39+H39=0,0,IF(G39=H39,1,0)))","v":2},{"$f":"IF(I39>J39,2,IF(I39+J39=0,0,IF(I39=J39,1,0)))","v":0},{"$f":"IF(I39<J39,2,IF(I39+J39=0,0,IF(I39=J39,1,0)))","v":2},null,null,{"$f":"IF(M39>N39,2,IF(M39+N39=0,0,IF(M39=N39,1,0)))","v":0},{"$f":"IF(M39<N39,2,IF(M39+N39=0,0,IF(M39=N39,1,0)))","v":2},{"$f":"IF(O39>P39,2,IF(O39+P39=0,0,IF(O39=P39,1,0)))","v":0},{"$f":"IF(O39<P39,2,IF(O39+P39=0,0,IF(O39=P39,1,0)))","v":2},{"$f":"IF(Q39>R39,2,IF(Q39+R39=0,0,IF(Q39=R39,1,0)))","v":0},{"$f":"IF(Q39<R39,2,IF(Q39+R39=0,0,IF(Q39=R39,1,0)))","v":2},{"$f":"IF(S39>T39,2,IF(S39+T39=0,0,IF(S39=T39,1,0)))","v":0},{"$f":"IF(S39<T39,2,IF(S39+T39=0,0,IF(S39=T39,1,0)))","v":2},{"$f":"SUM(C40,E40,G40,I40,K40,M40,O40,Q40,S40)","v":2}]
[null,{"$f":"[1]Beschrieb!$F$7","v":"        Rh. Leipzig"},{"$f":"'SpPl. Vorrd.'!AF31","v":7},{"$f":"'SpPl. Vorrd.'!AD31","v":9},{"$f":"'SpPl. Vorrd.'!AF23","v":6},{"$f":"'SpPl. Vorrd.'!AD23","v":20},{"$f":"'SpPl. Vorrd.'!AF78","v":4},{"$f":"'SpPl. Vorrd.'!AD78","v":20},{"$f":"'SpPl. Vorrd.'!AF85","v":8},{"$f":"'SpPl. Vorrd.'!AD85","v":15},{"$f":"'SpPl. Vorrd.'!AF59","v":11},{"$f":"'SpPl. Vorrd.'!AD59","v":8},null,null,{"$f":"'SpPl. Vorrd.'!AD51","v":7},{"$f":"'SpPl. Vorrd.'!AF51","v":12},{"$f":"'SpPl. Vorrd.'!AD94","v":9},{"$f":"'SpPl. Vorrd.'!AF94","v":11},{"$f":"'SpPl. Vorrd.'!AD71","v":16},{"$f":"'SpPl. Vorrd.'!AF71","v":9},{"$f":"SUM(C41,E41,G41,I41,K41,M41,O41,Q41,S41,)","v":68},{"$f":"SUM(D41,F41,H41,J41,L41,N41,P41,R41,T41,)","v":104},{"$f":"U42","v":4},8]
[null,null,{"$f":"IF(C41>D41,2,IF(C41+D41=0,0,IF(C41=D41,1,0)))","v":0},{"$f":"IF(C41<D41,2,IF(C41+D41=0,0,IF(C41=D41,1,0)))","v":2},{"$f":"IF(E41>F41,2,IF(E41+F41=0,0,IF(E41=F41,1,0)))","v":0},{"$f":"IF(E41<F41,2,IF(E41+F41=0,0,IF(E41=F41,1,0)))","v":2},{"$f":"IF(G41>H41,2,IF(G41+H41=0,0,IF(G41=H41,1,0)))","v":0},{"$f":"IF(G41<H41,2,IF(G41+H41=0,0,IF(G41=H41,1,0)))","v":2},{"$f":"IF(I41>J41,2,IF(I41+J41=0,0,IF(I41=J41,1,0)))","v":0},{"$f":"IF(I41<J41,2,IF(I41+J41=0,0,IF(I41=J41,1,0)))","v":2},{"$f":"IF(K41>L41,2,IF(K41+L41=0,0,IF(K41=L41,1,0)))","v":2},{"$f":"IF(K41<L41,2,IF(K41+L41=0,0,IF(K41=L41,1,0)))","v":0},null,null,{"$f":"IF(O41>P41,2,IF(O41+P41=0,0,IF(O41=P41,1,0)))","v":0},{"$f":"IF(O41<P41,2,IF(O41+P41=0,0,IF(O41=P41,1,0)))","v":2},{"$f":"IF(Q41>R41,2,IF(Q41+R41=0,0,IF(Q41=R41,1,0)))","v":0},{"$f":"IF(Q41<R41,2,IF(Q41+R41=0,0,IF(Q41=R41,1,0)))","v":2},{"$f":"IF(S41>T41,2,IF(S41+T41=0,0,IF(S41=T41,1,0)))","v":2},{"$f":"IF(S41<T41,2,IF(S41+T41=0,0,IF(S41=T41,1,0)))","v":0},{"$f":"SUM(C42,E42,G42,I42,K42,M42,O42,Q42,S42)","v":4}]
[null,{"$f":"[1]Beschrieb!$F$8","v":"        Grevesmühlen"},{"$f":"'SpPl. Vorrd.'!AF43","v":12},{"$f":"'SpPl. Vorrd.'!AD43","v":10},{"$f":"'SpPl. Vorrd.'!AF36","v":9},{"$f":"'SpPl. Vorrd.'!AD36","v":15},{"$f":"'SpPl. Vorrd.'!AF24","v":9},{"$f":"'SpPl. Vorrd.'!AD24","v":17},{"$f":"'SpPl. Vorrd.'!AF73","v":11},{"$f":"'SpPl. Vorrd.'!AD73","v":11},{"$f":"'SpPl. Vorrd.'!AF86","v":15},{"$f":"'SpPl. Vorrd.'!AD86","v":14},{"$f":"'SpPl. Vorrd.'!AF51","v":12},{"$f":"'SpPl. Vorrd.'!AD51","v":7},null,null,{"$f":"'SpPl. Vorrd.'!AD66","v":6},{"$f":"'SpPl. Vorrd.'!AF66","v":16},{"$f":"'SpPl. Vorrd.'!AD99","v":8},{"$f":"'SpPl. Vorrd.'!AF99","v":14},{"$f":"SUM(C43,E43,G43,I43,K43,M43,O43,Q43,S43,)","v":82},{"$f":"SUM(D43,F43,H43,J43,L43,N43,P43,R43,T43,)","v":104},{"$f":"U44","v":7},7]
[null,null,{"$f":"IF(C43>D43,2,IF(C43+D43=0,0,IF(C43=D43,1,0)))","v":2},{"$f":"IF(C43<D43,2,IF(C43+D43=0,0,IF(C43=D43,1,0)))","v":0},{"$f":"IF(E43>F43,2,IF(E43+F43=0,0,IF(E43=F43,1,0)))","v":0},{"$f":"IF(E43<F43,2,IF(E43+F43=0,0,IF(E43=F43,1,0)))","v":2},{"$f":"IF(G43>H43,2,IF(G43+H43=0,0,IF(G43=H43,1,0)))","v":0},{"$f":"IF(G43<H43,2,IF(G43+H43=0,0,IF(G43=H43,1,0)))","v":2},{"$f":"IF(I43>J43,2,IF(I43+J43=0,0,IF(I43=J43,1,0)))","v":1},{"$f":"IF(I43<J43,2,IF(I43+J43=0,0,IF(I43=J43,1,0)))","v":1},{"$f":"IF(K43>L43,2,IF(K43+L43=0,0,IF(K43=L43,1,0)))","v":2},{"$f":"IF(K43<L43,2,IF(K43+L43=0,0,IF(K43=L43,1,0)))","v":0},{"$f":"IF(M43>N43,2,IF(M43+N43=0,0,IF(M43=N43,1,0)))","v":2},{"$f":"IF(M43<N43,2,IF(M43+N43=0,0,IF(M43=N43,1,0)))","v":0},null,null,{"$f":"IF(Q43>R43,2,IF(Q43+R43=0,0,IF(Q43=R43,1,0)))","v":0},{"$f":"IF(Q43<R43,2,IF(Q43+R43=0,0,IF(Q43=R43,1,0)))","v":2},{"$f":"IF(S43>T43,2,IF(S43+T43=0,0,IF(S43=T43,1,0)))","v":0},{"$f":"IF(S43<T43,2,IF(S43+T43=0,0,IF(S43=T43,1,0)))","v":2},{"$f":"SUM(C44,E44,G44,I44,K44,M44,O44,Q44,S44)","v":7}]
[null,{"$f":"[1]Beschrieb!$F$9","v":"        RBA Neumarkt"},{"$f":"'SpPl. Vorrd.'!AF87","v":9},{"$f":"'SpPl. Vorrd.'!AD87","v":10},{"$f":"'SpPl. Vorrd.'!AF44","v":10},{"$f":"'SpPl. Vorrd.'!AD44","v":9},{"$f":"'SpPl. Vorrd.'!AF37","v":19},{"$f":"'SpPl. Vorrd.'!AD37","v":5},{"$f":"'SpPl. Vorrd.'!AF29","v":5},{"$f":"'SpPl. Vorrd.'!AD29","v":13},{"$f":"'SpPl. Vorrd.'!AF72","v":17},{"$f":"'SpPl. Vorrd.'!AD72","v":7},{"$f":"'SpPl. Vorrd.'!AF94","v":11},{"$f":"'SpPl. Vorrd.'!AD94","v":9},{"$f":"'SpPl. Vorrd.'!AF66","v":16},{"$f":"'SpPl. Vorrd.'!AD66","v":6},null,null,{"$f":"'SpPl. Vorrd.'!AD52","v":13},{"$f":"'SpPl. Vorrd.'!AF52","v":10},{"$f":"SUM(C45,E45,G45,I45,K45,M45,O45,Q45,S45,)","v":100},{"$f":"SUM(D45,F45,H45,J45,L45,N45,P45,R45,T45,)","v":69},{"$f":"U46","v":12},2]
[null,null,{"$f":"IF(C45>D45,2,IF(C45+D45=0,0,IF(C45=D45,1,0)))","v":0},{"$f":"IF(C45<D45,2,IF(C45+D45=0,0,IF(C45=D45,1,0)))","v":2},{"$f":"IF(E45>F45,2,IF(E45+F45=0,0,IF(E45=F45,1,0)))","v":2},{"$f":"IF(E45<F45,2,IF(E45+F45=0,0,IF(E45=F45,1,0)))","v":0},{"$f":"IF(G45>H45,2,IF(G45+H45=0,0,IF(G45=H45,1,0)))","v":2},{"$f":"IF(G45<H45,2,IF(G45+H45=0,0,IF(G45=H45,1,0)))","v":0},{"$f":"IF(I45>J45,2,IF(I45+J45=0,0,IF(I45=J45,1,0)))","v":0},{"$f":"IF(I45<J45,2,IF(I45+J45=0,0,IF(I45=J45,1,0)))","v":2},{"$f":"IF(K45>L45,2,IF(K45+L45=0,0,IF(K45=L45,1,0)))","v":2},{"$f":"IF(K45<L45,2,IF(K45+L45=0,0,IF(K45=L45,1,0)))","v":0},{"$f":"IF(M45>N45,2,IF(M45+N45=0,0,IF(M45=N45,1,0)))","v":2},{"$f":"IF(M45<N45,2,IF(M45+N45=0,0,IF(M45=N45,1,0)))","v":0},{"$f":"IF(O45>P45,2,IF(O45+P45=0,0,IF(O45=P45,1,0)))","v":2},{"$f":"IF(O45<P45,2,IF(O45+P45=0,0,IF(O45=P45,1,0)))","v":0},null,null,{"$f":"IF(S45>T45,2,IF(S45+T45=0,0,IF(S45=T45,1,0)))","v":2},{"$f":"IF(S45<T45,2,IF(S45+T45=0,0,IF(S45=T45,1,0)))","v":0},{"$f":"SUM(C46,E46,G46,I46,K46,M46,O46,Q46,S46)","v":12}]
[null,{"$f":"[1]Beschrieb!$F$10","v":"        BSG Mettmann"},{"$f":"'SpPl. Vorrd.'!AF80","v":12},{"$f":"'SpPl. Vorrd.'!AD80","v":9},{"$f":"'SpPl. Vorrd.'!AF92","v":11},{"$f":"'SpPl. Vorrd.'!AD92","v":13},{"$f":"'SpPl. Vorrd.'!AF45","v":12},{"$f":"'SpPl. Vorrd.'!AD45","v":8},{"$f":"'SpPl. Vorrd.'!AF38","v":10},{"$f":"'SpPl. Vorrd.'!AD38","v":13},{"$f":"'SpPl. Vorrd.'!AF30","v":18},{"$f":"'SpPl. Vorrd.'!AD30","v":7},{"$f":"'SpPl. Vorrd.'!AF71","v":9},{"$f":"'SpPl. Vorrd.'!AD71","v":16},{"$f":"'SpPl. Vorrd.'!AF99","v":14},{"$f":"'SpPl. Vorrd.'!AD99","v":8},{"$f":"'SpPl. Vorrd.'!AF52","v":10},{"$f":"'SpPl. Vorrd.'!AD52","v":13},null,null,{"$f":"SUM(C47,E47,G47,I47,K47,M47,O47,Q47,S47,)","v":96},{"$f":"SUM(D47,F47,H47,J47,L47,N47,P47,R47,T47,)","v":87},{"$f":"U48","v":8},5]
[null,null,{"$f":"IF(C47>D47,2,IF(C47+D47=0,0,IF(C47=D47,1,0)))","v":2},{"$f":"IF(C47<D47,2,IF(C47+D47=0,0,IF(C47=D47,1,0)))","v":0},{"$f":"IF(E47>F47,2,IF(E47+F47=0,0,IF(E47=F47,1,0)))","v":0},{"$f":"IF(E47<F47,2,IF(E47+F47=0,0,IF(E47=F47,1,0)))","v":2},{"$f":"IF(G47>H47,2,IF(G47+H47=0,0,IF(G47=H47,1,0)))","v":2},{"$f":"IF(G47<H47,2,IF(G47+H47=0,0,IF(G47=H47,1,0)))","v":0},{"$f":"IF(I47>J47,2,IF(I47+J47=0,0,IF(I47=J47,1,0)))","v":0},{"$f":"IF(I47<J47,2,IF(I47+J47=0,0,IF(I47=J47,1,0)))","v":2},{"$f":"IF(K47>L47,2,IF(K47+L47=0,0,IF(K47=L47,1,0)))","v":2},{"$f":"IF(K47<L47,2,IF(K47+L47=0,0,IF(K47=L47,1,0)))","v":0},{"$f":"IF(M47>N47,2,IF(M47+N47=0,0,IF(M47=N47,1,0)))","v":0},{"$f":"IF(M47<N47,2,IF(M47+N47=0,0,IF(M47=N47,1,0)))","v":2},{"$f":"IF(O47>P47,2,IF(O47+P47=0,0,IF(O47=P47,1,0)))","v":2},{"$f":"IF(O47<P47,2,IF(O47+P47=0,0,IF(O47=P47,1,0)))","v":0},{"$f":"IF(Q47>R47,2,IF(Q47+R47=0,0,IF(Q47=R47,1,0)))","v":0},{"$f":"IF(Q47<R47,2,IF(Q47+R47=0,0,IF(Q47=R47,1,0)))","v":2},null,null,{"$f":"SUM(C48,E48,G48,I48,K48,M48,O48,Q48,S48)","v":8}]

{"sheet":"SpPl. Zw.u.End-Rd.","index":2,"n_rows":31,"n_cols":35,"rows_kept":31,"cut":false,"hidden":false,"merged":[[30,23,30,26],[27,23,27,26],[28,0,28,1],[29,1,30,1],[29,5,29,10],[29,12,29,17],[29,18,29,22],[29,23,29,26],[30,5,30,10],[30,12,30,17],[30,18,30,22],[22,1,27,1],[25,5,25,10],[25,12,25,17],[25,18,27,22],[25,23,25,26],[25,34,25,35],[26,5,26,10],[26,12,26,17],[26,23,26,26],[27,5,27,10],[27,12,27,17],[22,31,22,32],[22,34,22,35],[23,5,23,10],[23,12,23,17],[23,23,23,26],[23,31,23,32],[23,34,23,35],[22,5,22,10],[22,12,22,17],[22,18,24,22],[22,23,22,26],[24,5,24,10],[24,12,24,17],[24,23,24,26],[24,34,24,35],[16,34,16,35],[17,34,17,35],[18,34,18,35],[19,34,19,35],[21,34,21,35],[14,34,14,35],[15,1,20,1],[15,5,15,10],[15,12,15,17],[15,18,15,22],[15,23,15,26],[15,34,15,35],[16,5,16,10],[16,12,16,17],[16,18,16,22],[20,5,20,10],[20,12,20,17],[20,18,20,22],[20,23,20,26],[20,34,20,35],[16,23,16,26],[11,34,11,35],[12,5,12,10],[12,12,12,17],[12,23,12,26],[12,34,12,35],[10,23,10,26],[11,5,11,10],[11,12,11,17],[11,18,13,22],[11,23,11,26],[7,34,7,35],[8,1,13,1],[8,5,8,10],[8,12,8,17],[8,18,10,22],[8,23,8,26],[9,5,9,10],[9,12,9,17],[9,23,9,26],[9,34,9,35],[13,5,13,10],[13,12,13,17],[13,23,13,26],[13,34,13,35],[10,5,10,10],[10,12,10,17],[2,5,2,26],[2,33,3,35],[5,0,5,1],[5,3,6,3],[5,5,6,17],[5,18,6,22],[5,23,6,26],[5,28,6,30],[5,34,5,35]]}
[]
[]
[{"$nulls":5},"Spielplan Endrunde:",{"$nulls":27},"Endergebnis:"]
[]
[]
["Spiel",null,null,"Bahn:",null,"Mannschaften:",{"$nulls":12},"Linienrichter",{"$nulls":4},"Schiedsrichter",{"$nulls":4},"Ergebnis:",{"$nulls":4},"1. Sieger",{"$f":"IF(AC31>AE31,F31,M31)","v":"BRS Gersweiler 2"}]
["Nr."," DG Zeit"]
[{"$nulls":33},"2. Sieger","BSSV Köthen"]
[73,"DG 13   13.30",null,1,null,"BSSV Köthen",{"$nulls":6},"RBA Neumarkt",{"$nulls":5},"ZGS Berlin",{"$nulls":4},"Beck Adolph",{"$nulls":4},12,":",11]
[74,null,null,2,null,"BVS Weiden",{"$nulls":6},"BRS Gersweiler 2",{"$nulls":10},"Schmid Angelika",{"$nulls":4},9,":",12,null,null,"3. Sieger","RBA Neumarkt"]
[75,null,null,3,null,"TV Markgröningen",{"$nulls":6},"VSG Stadthagen",{"$nulls":10},"Friedrich Chr.",{"$nulls":4},12,":",9]
[76,null,null,4,null,"VSG Gelsenkirchen",{"$nulls":6},"BSG Nordwalde",{"$nulls":5},"BRV Berlin",{"$nulls":4},"Schmid K.-H.",{"$nulls":4},19,":",7,null,null,"4. Sieger","BVS Weiden"]
[77,null,null,5,null,"RSG Partenstein",{"$nulls":6},"Rh. Wiesbaden 1",{"$nulls":10},"Ahrens",{"$nulls":4},9,":",19,null,null,"5. Sieger",{"$f":"IF(AC28>AE28,F28,M28)","v":"VSG Gelsenkirchen"}]
[78,null,null,6,null,"BRS Gersweiler 1",{"$nulls":6},"BSG Mettmann",{"$nulls":10},"Rödel",{"$nulls":4},15,":",13,null,null,"6. Sieger",{"$f":"IF(AC28<AE28,F28,M28)","v":"TV Markgröningen"}]
[{"$nulls":33},"7. Sieger",{"$f":"IF(AC27>AE27,F27,M27)","v":"VSG Stadthagen"}]
[79,"DG 14   14.15",null,1,null,"ZGS Berlin",{"$nulls":6},"Rh. Leipzig",{"$nulls":5},"Gersweiler",{"$nulls":4},"Sachsenanhalt",{"$nulls":4},16,":",9,null,null,"8. Sieger",{"$f":"IF(AC27<AE27,F27,M27)","v":"BSG Nordwalde"}]
[80,null,null,2,null,"Rh. Wiesbaden 2",{"$nulls":6},"BRSV Grevesmühlen",{"$nulls":5},"Gersweiler",{"$nulls":4},"Berlin",{"$nulls":4},11,":",13,null,null,"9. Sieger",{"$f":"IF(AC26>AE26,F26,M26)","v":"BRS Gersweiler 1"}]
[{"$nulls":33},"10. Sieger",{"$f":"IF(AC26<AE26,F26,M26)","v":"Rh. Wiesbaden 1"}]
[{"$nulls":33},"11. Sieger",{"$f":"IF(AC25>AE25,F25,M25)","v":"BSG Mettmann"}]
[{"$nulls":33},"12. Sieger",{"$f":"IF(AC25<AE25,F25,M25)","v":"RSG Partenstein"}]
[81,null,null,4,null,"BSG Offenburg",{"$nulls":6},"BRV Berlin",{"$nulls":5},"Gersweiler",{"$nulls":4},"NRW",{"$nulls":4},9,":",12,"17/18",null,"13. Sieger",{"$f":"IF(AC24>AE24,F24,M24)","v":"ZGS Berlin"}]
[{"$nulls":33},"14. Sieger",{"$f":"IF(AC24<AE24,F24,M24)","v":"BRSV Grevesmühlen"}]
[82,"DG 15   15.00",null,1,null,{"$f":"IF(AC16<AE16,F16,M16)","v":"Rh. Leipzig"},{"$nulls":6},{"$f":"IF(AC17<AE17,F17,M17)","v":"Rh. Wiesbaden 2"},{"$nulls":5},"Offenburg",{"$nulls":4},"Beck adolph",{"$nulls":4},16,":",12,"15/16",null,"15. Sieger",{"$f":"IF(AC23>AE23,F23,M23)","v":"Rh. Leipzig"}]
[83,null,null,2,null,{"$f":"IF(AC16>AE16,F16,M16)","v":"ZGS Berlin"},{"$nulls":6},{"$f":"IF(AC17>AE17,F17,M17)","v":"BRSV Grevesmühlen"},{"$nulls":10},"Schmid Angelika",{"$nulls":4},10,":",7,"13/14",null,"16. Sieger",{"$f":"IF(AC23<AE23,F23,M23)","v":"Rh. Wiesbaden 2"}]
[84,null,null,3,null,{"$f":"IF(AC13<AE13,F13,M13)","v":"RSG Partenstein"},{"$nulls":6},{"$f":"IF(AC14<AE14,F14,M14)","v":"BSG Mettmann"},{"$nulls":10},"Schmid K.-H.",{"$nulls":4},11,":",14,"12/11",null,"17. Sieger",{"$f":"IF(AC21>AE21,F21,M21)","v":"BRV Berlin"}]
[85,null,null,4,null,{"$f":"IF(AC13>AE13,F13,M13)","v":"Rh. Wiesbaden 1"},{"$nulls":6},{"$f":"IF(AC14>AE14,F14,M14)","v":"BRS Gersweiler 1"},{"$nulls":5},"BRV Berlin",{"$nulls":4},"Friedrich Christian",{"$nulls":4},8,":",12,"9/10",null,"18. Sieger",{"$f":"IF(AC21<AE21,F21,M21)","v":"BSG Offenburg"}]
[86,null,null,5,null,{"$f":"IF(AC11<AE11,F11,M11)","v":"VSG Stadthagen"},{"$nulls":6},{"$f":"IF(AC12<AE12,F12,M12)","v":"BSG Nordwalde"},{"$nulls":10},"Ahrens",{"$nulls":4},15,":",8,"7/8"]
[87,null,null,6,null,{"$f":"IF(AC11>AE11,F11,M11)","v":"TV Markgröningen"},{"$nulls":6},{"$f":"IF(AC12>AE12,F12,M12)","v":"VSG Gelsenkirchen"},{"$nulls":10},"Rödel",{"$nulls":4},11,":",13,"5/6"]
[{"$nulls":5},"Endspiele um Platz 3 und 4 und Platz 1 und 2"]
[88,"DG 16   14.15",null,1,null,{"$f":"IF(AC9<AE9,F9,M9)","v":"RBA Neumarkt"},{"$nulls":6},{"$f":"IF(AC10<AE10,F10,M10)","v":"BVS Weiden"},{"$nulls":5},"Nordwalde",{"$nulls":4},{"$f":"[1]Beschrieb!D12","v":"Schmid K.-H."},{"$nulls":4},10,":",9,"3/4"]
[89,null,null,2,null,{"$f":"IF(AC9>AE9,F9,M9)","v":"BSSV Köthen"},{"$nulls":6},{"$f":"IF(AC10>AE10,F10,M10)","v":"BRS Gersweiler 2"},{"$nulls":5},"Stadthagen",{"$nulls":4},"Friedrich Chr.",{"$nulls":4},10,":",13,"1/2"]